{"text_format":"3","workbook":"xlsx","n_sheets":10,"sheets":["мониторинг","физкультура","соц-ком","познават","речевое","худ-эст","музыка","дети","АННОТАЦИЯ","Лист1"],"not_rendered":{"charts":7,"defined_names":1},"read":"whole","date_system":"1900"}

{"sheet":"мониторинг","index":0,"n_rows":39,"n_cols":18,"rows_kept":39,"merged":[[0,0,0,17],[3,0,3,17],[4,0,6,0],[4,2,4,17],[5,2,5,3],[5,4,5,5],[5,6,5,7],[5,8,5,9],[5,10,5,11],[5,12,5,13],[5,14,5,15],[5,16,5,17],[35,0,35,1]]}
[{"$f":"дети!A38","v":"Мониторинг образовательного процесса группы № __  (младшая) на 20__-20__ уч.г."}]
[{"$f":"дети!A39","v":"Воспитатель: _____________________________"}]
[{"$f":"дети!A40","v":"Воспитатель: ________________________________"}]
["Сводная мониторинга образовательного процесса "]
["№ п/п","Имя,","Уровень развития по образовательным областям"]
[null,"фамилия ребенка","Физическая культура",null,"социально-коммуникативное",null,"Познавательное развитие",null,"Речевое развитие ",null,"художественно-эстетическое",null,"Музыкально-художественная деятельность",null,"Итоговый результат",null,"Уровень"]
[null,null,"н.г.","к.г.","н.г.","к.г.","н.г.","к.г.","н.г.","к.г.","н.г.","к.г.","н.г.","к.г.","н.г.","к.г.","н.г.","к.г."]
[1,{"$f":"дети!A1","v":0},{"v":0,"d":"0.0"},{"v":0,"d":"0.0"},{"v":0,"d":"0.0"},{"v":0,"d":"0.0"},{"v":0,"d":"0.0"},{"v":0,"d":"0.0"},{"v":0,"d":"0.0"},{"v":0,"d":"0.0"},{"v":0,"d":"0.0"},{"v":0,"d":"0.0"},{"v":0,"d":"0.0"},{"v":0,"d":"0.0"},{"$f":"(C8+E8+G8+I8+K8+M8)/6","v":{"v":0,"d":"0.0"}},{"$f":"(D8+F8+H8+J8+L8+N8)/6","v":{"v":0,"d":"0.0"}},{"$f":"IF(O8>2.9,\"B\",IF(O8>=2,\"C\",\"HC\"))","v":"HC"},{"$f":"IF(P8>2.9,\"B\",IF(P8>=2,\"C\",\"HC\"))","v":"HC"}]
[2,{"$f":"дети!A2","v":0},{"v":0,"d":"0.0"},{"v":0,"d":"0.0"},{"v":0,"d":"0.0"},{"v":0,"d":"0.0"},{"v":0,"d":"0.0"},{"v":0,"d":"0.0"},{"v":0,"d":"0.0"},{"v":0,"d":"0.0"},{"v":0,"d":"0.0"},{"v":0,"d":"0.0"},{"v":0,"d":"0.0"},{"v":0,"d":"0.0"},{"v":0,"d":"0.0"},{"v":0,"d":"0.0"},"HC","HC"]
[3,{"$f":"дети!A3","v":0},{"v":0,"d":"0.0"},{"v":0,"d":"0.0"},{"v":0,"d":"0.0"},{"v":0,"d":"0.0"},{"v":0,"d":"0.0"},{"v":0,"d":"0.0"},{"v":0,"d":"0.0"},{"v":0,"d":"0.0"},{"v":0,"d":"0.0"},{"v":0,"d":"0.0"},{"v":0,"d":"0.0"},{"v":0,"d":"0.0"},{"v":0,"d":"0.0"},{"v":0,"d":"0.0"},"HC","HC"]
[4,{"$f":"дети!A4","v":0},{"v":0,"d":"0.0"},{"v":0,"d":"0.0"},{"v":0,"d":"0.0"},{"v":0,"d":"0.0"},{"v":0,"d":"0.0"},{"v":0,"d":"0.0"},{"v":0,"d":"0.0"},{"v":0,"d":"0.0"},{"v":0,"d":"0.0"},{"v":0,"d":"0.0"},{"v":0,"d":"0.0"},{"v":0,"d":"0.0"},{"v":0,"d":"0.0"},{"v":0,"d":"0.0"},"HC","HC"]
[5,{"$f":"дети!A5","v":0},{"v":0,"d":"0.0"},{"v":0,"d":"0.0"},{"v":0,"d":"0.0"},{"v":0,"d":"0.0"},{"v":0,"d":"0.0"},{"v":0,"d":"0.0"},{"v":0,"d":"0.0"},{"v":0,"d":"0.0"},{"v":0,"d":"0.0"},{"v":0,"d":"0.0"},{"v":0,"d":"0.0"},{"v":0,"d":"0.0"},{"v":0,"d":"0.0"},{"v":0,"d":"0.0"},"HC","HC"]
[6,{"$f":"дети!A6","v":0},{"v":0,"d":"0.0"},{"v":0,"d":"0.0"},{"v":0,"d":"0.0"},{"v":0,"d":"0.0"},{"v":0,"d":"0.0"},{"v":0,"d":"0.0"},{"v":0,"d":"0.0"},{"v":0,"d":"0.0"},{"v":0,"d":"0.0"},{"v":0,"d":"0.0"},{"v":0,"d":"0.0"},{"v":0,"d":"0.0"},{"v":0,"d":"0.0"},{"v":0,"d":"0.0"},"HC","HC"]
[7,{"$f":"дети!A7","v":0},{"v":0,"d":"0.0"},{"v":0,"d":"0.0"},{"v":0,"d":"0.0"},{"v":0,"d":"0.0"},{"v":0,"d":"0.0"},{"v":0,"d":"0.0"},{"v":0,"d":"0.0"},{"v":0,"d":"0.0"},{"v":0,"d":"0.0"},{"v":0,"d":"0.0"},{"v":0,"d":"0.0"},{"v":0,"d":"0.0"},{"v":0,"d":"0.0"},{"v":0,"d":"0.0"},"HC","HC"]
[8,{"$f":"дети!A8","v":0},{"v":0,"d":"0.0"},{"v":0,"d":"0.0"},{"v":0,"d":"0.0"},{"v":0,"d":"0.0"},{"v":0,"d":"0.0"},{"v":0,"d":"0.0"},{"v":0,"d":"0.0"},{"v":0,"d":"0.0"},{"v":0,"d":"0.0"},{"v":0,"d":"0.0"},{"v":0,"d":"0.0"},{"v":0,"d":"0.0"},{"v":0,"d":"0.0"},{"v":0,"d":"0.0"},"HC","HC"]
[9,{"$f":"дети!A9","v":0},{"v":0,"d":"0.0"},{"v":0,"d":"0.0"},{"v":0,"d":"0.0"},{"v":0,"d":"0.0"},{"v":0,"d":"0.0"},{"v":0,"d":"0.0"},{"v":0,"d":"0.0"},{"v":0,"d":"0.0"},{"v":0,"d":"0.0"},{"v":0,"d":"0.0"},{"v":0,"d":"0.0"},{"v":0,"d":"0.0"},{"v":0,"d":"0.0"},{"v":0,"d":"0.0"},"HC","HC"]
[10,{"$f":"дети!A10","v":0},{"v":0,"d":"0.0"},{"v":0,"d":"0.0"},{"v":0,"d":"0.0"},{"v":0,"d":"0.0"},{"v":0,"d":"0.0"},{"v":0,"d":"0.0"},{"v":0,"d":"0.0"},{"v":0,"d":"0.0"},{"v":0,"d":"0.0"},{"v":0,"d":"0.0"},{"v":0,"d":"0.0"},{"v":0,"d":"0.0"},{"v":0,"d":"0.0"},{"v":0,"d":"0.0"},"HC","HC"]
[11,{"$f":"дети!A11","v":0},{"v":0,"d":"0.0"},{"v":0,"d":"0.0"},{"v":0,"d":"0.0"},{"v":0,"d":"0.0"},{"v":0,"d":"0.0"},{"v":0,"d":"0.0"},{"v":0,"d":"0.0"},{"v":0,"d":"0.0"},{"v":0,"d":"0.0"},{"v":0,"d":"0.0"},{"v":0,"d":"0.0"},{"v":0,"d":"0.0"},{"v":0,"d":"0.0"},{"v":0,"d":"0.0"},"HC","HC"]
[12,{"$f":"дети!A12","v":0},{"v":0,"d":"0.0"},{"v":0,"d":"0.0"},{"v":0,"d":"0.0"},{"v":0,"d":"0.0"},{"v":0,"d":"0.0"},{"v":0,"d":"0.0"},{"v":0,"d":"0.0"},{"v":0,"d":"0.0"},{"v":0,"d":"0.0"},{"v":0,"d":"0.0"},{"v":0,"d":"0.0"},{"v":0,"d":"0.0"},{"v":0,"d":"0.0"},{"v":0,"d":"0.0"},"HC","HC"]
[13,{"$f":"дети!A13","v":0},{"v":0,"d":"0.0"},{"v":0,"d":"0.0"},{"v":0,"d":"0.0"},{"v":0,"d":"0.0"},{"v":0,"d":"0.0"},{"v":0,"d":"0.0"},{"v":0,"d":"0.0"},{"v":0,"d":"0.0"},{"v":0,"d":"0.0"},{"v":0,"d":"0.0"},{"v":0,"d":"0.0"},{"v":0,"d":"0.0"},{"v":0,"d":"0.0"},{"v":0,"d":"0.0"},"HC","HC"]
[14,{"$f":"дети!A14","v":0},{"v":0,"d":"0.0"},{"v":0,"d":"0.0"},{"v":0,"d":"0.0"},{"v":0,"d":"0.0"},{"v":0,"d":"0.0"},{"v":0,"d":"0.0"},{"v":0,"d":"0.0"},{"v":0,"d":"0.0"},{"v":0,"d":"0.0"},{"v":0,"d":"0.0"},{"v":0,"d":"0.0"},{"v":0,"d":"0.0"},{"v":0,"d":"0.0"},{"v":0,"d":"0.0"},"HC","HC"]
[15,{"$f":"дети!A15","v":0},{"v":0,"d":"0.0"},{"v":0,"d":"0.0"},{"v":0,"d":"0.0"},{"v":0,"d":"0.0"},{"v":0,"d":"0.0"},{"v":0,"d":"0.0"},{"v":0,"d":"0.0"},{"v":0,"d":"0.0"},{"v":0,"d":"0.0"},{"v":0,"d":"0.0"},{"v":0,"d":"0.0"},{"v":0,"d":"0.0"},{"v":0,"d":"0.0"},{"v":0,"d":"0.0"},"HC","HC"]
[16,{"$f":"дети!A16","v":0},{"v":0,"d":"0.0"},{"v":0,"d":"0.0"},{"v":0,"d":"0.0"},{"v":0,"d":"0.0"},{"v":0,"d":"0.0"},{"v":0,"d":"0.0"},{"v":0,"d":"0.0"},{"v":0,"d":"0.0"},{"v":0,"d":"0.0"},{"v":0,"d":"0.0"},{"v":0,"d":"0.0"},{"v":0,"d":"0.0"},{"v":0,"d":"0.0"},{"v":0,"d":"0.0"},"HC","HC"]
[17,{"$f":"дети!A17","v":0},{"v":0,"d":"0.0"},{"v":0,"d":"0.0"},{"v":0,"d":"0.0"},{"v":0,"d":"0.0"},{"v":0,"d":"0.0"},{"v":0,"d":"0.0"},{"v":0,"d":"0.0"},{"v":0,"d":"0.0"},{"v":0,"d":"0.0"},{"v":0,"d":"0.0"},{"v":0,"d":"0.0"},{"v":0,"d":"0.0"},{"v":0,"d":"0.0"},{"v":0,"d":"0.0"},"HC","HC"]
[18,{"$f":"дети!A18","v":0},{"v":0,"d":"0.0"},{"v":0,"d":"0.0"},{"v":0,"d":"0.0"},{"v":0,"d":"0.0"},{"v":0,"d":"0.0"},{"v":0,"d":"0.0"},{"v":0,"d":"0.0"},{"v":0,"d":"0.0"},{"v":0,"d":"0.0"},{"v":0,"d":"0.0"},{"v":0,"d":"0.0"},{"v":0,"d":"0.0"},{"v":0,"d":"0.0"},{"v":0,"d":"0.0"},"HC","HC"]
[19,{"$f":"дети!A19","v":0},{"v":0,"d":"0.0"},{"v":0,"d":"0.0"},{"v":0,"d":"0.0"},{"v":0,"d":"0.0"},{"v":0,"d":"0.0"},{"v":0,"d":"0.0"},{"v":0,"d":"0.0"},{"v":0,"d":"0.0"},{"v":0,"d":"0.0"},{"v":0,"d":"0.0"},{"v":0,"d":"0.0"},{"v":0,"d":"0.0"},{"v":0,"d":"0.0"},{"v":0,"d":"0.0"},"HC","HC"]
[20,{"$f":"дети!A20","v":0},{"v":0,"d":"0.0"},{"v":0,"d":"0.0"},{"v":0,"d":"0.0"},{"v":0,"d":"0.0"},{"v":0,"d":"0.0"},{"v":0,"d":"0.0"},{"v":0,"d":"0.0"},{"v":0,"d":"0.0"},{"v":0,"d":"0.0"},{"v":0,"d":"0.0"},{"v":0,"d":"0.0"},{"v":0,"d":"0.0"},{"$f":"(C27+E27+G27+I27+K27+M27)/6","v":{"v":0,"d":"0.0"}},{"$f":"(D27+F27+H27+J27+L27+N27)/6","v":{"v":0,"d":"0.0"}},"HC","HC"]
[21,{"$f":"дети!A21","v":0},{"v":0,"d":"0.0"},{"v":0,"d":"0.0"},{"v":0,"d":"0.0"},{"v":0,"d":"0.0"},{"v":0,"d":"0.0"},{"v":0,"d":"0.0"},{"v":0,"d":"0.0"},{"v":0,"d":"0.0"},{"v":0,"d":"0.0"},{"v":0,"d":"0.0"},{"v":0,"d":"0.0"},{"v":0,"d":"0.0"},{"v":0,"d":"0.0"},{"v":0,"d":"0.0"},"HC","HC"]
[22,{"$f":"дети!A22","v":0},{"v":0,"d":"0.0"},{"v":0,"d":"0.0"},{"v":0,"d":"0.0"},{"v":0,"d":"0.0"},{"v":0,"d":"0.0"},{"v":0,"d":"0.0"},{"v":0,"d":"0.0"},{"v":0,"d":"0.0"},{"v":0,"d":"0.0"},{"v":0,"d":"0.0"},{"v":0,"d":"0.0"},{"v":0,"d":"0.0"},{"v":0,"d":"0.0"},{"v":0,"d":"0.0"},"HC","HC"]
[23,{"$f":"дети!A23","v":0},{"v":0,"d":"0.0"},{"v":0,"d":"0.0"},{"v":0,"d":"0.0"},{"v":0,"d":"0.0"},{"v":0,"d":"0.0"},{"v":0,"d":"0.0"},{"v":0,"d":"0.0"},{"v":0,"d":"0.0"},{"v":0,"d":"0.0"},{"v":0,"d":"0.0"},{"v":0,"d":"0.0"},{"v":0,"d":"0.0"},{"v":0,"d":"0.0"},{"v":0,"d":"0.0"},"HC","HC"]
[24,{"$f":"дети!A24","v":0},{"v":0,"d":"0.0"},{"v":0,"d":"0.0"},{"v":0,"d":"0.0"},{"v":0,"d":"0.0"},{"v":0,"d":"0.0"},{"v":0,"d":"0.0"},{"v":0,"d":"0.0"},{"v":0,"d":"0.0"},{"v":0,"d":"0.0"},{"v":0,"d":"0.0"},{"v":0,"d":"0.0"},{"v":0,"d":"0.0"},{"v":0,"d":"0.0"},{"v":0,"d":"0.0"},"HC","HC"]
[25,{"$f":"дети!A25","v":0},{"v":0,"d":"0.0"},{"v":0,"d":"0.0"},{"v":0,"d":"0.0"},{"v":0,"d":"0.0"},{"v":0,"d":"0.0"},{"v":0,"d":"0.0"},{"v":0,"d":"0.0"},{"v":0,"d":"0.0"},{"v":0,"d":"0.0"},{"v":0,"d":"0.0"},{"v":0,"d":"0.0"},{"v":0,"d":"0.0"},{"v":0,"d":"0.0"},{"v":0,"d":"0.0"},"HC","HC"]
[26,{"$f":"дети!A26","v":0},{"v":0,"d":"0.0"},{"v":0,"d":"0.0"},{"v":0,"d":"0.0"},{"v":0,"d":"0.0"},{"v":0,"d":"0.0"},{"v":0,"d":"0.0"},{"v":0,"d":"0.0"},{"v":0,"d":"0.0"},{"v":0,"d":"0.0"},{"v":0,"d":"0.0"},{"v":0,"d":"0.0"},{"v":0,"d":"0.0"},{"v":0,"d":"0.0"},{"v":0,"d":"0.0"},"HC","HC"]
[27,{"$f":"дети!A27","v":0},{"v":0,"d":"0.0"},{"v":0,"d":"0.0"},{"v":0,"d":"0.0"},{"v":0,"d":"0.0"},{"v":0,"d":"0.0"},{"v":0,"d":"0.0"},{"v":0,"d":"0.0"},{"v":0,"d":"0.0"},{"v":0,"d":"0.0"},{"v":0,"d":"0.0"},{"v":0,"d":"0.0"},{"v":0,"d":"0.0"},{"v":0,"d":"0.0"},{"v":0,"d":"0.0"},"HC","HC"]
[28,{"$f":"дети!A28","v":0},{"v":0,"d":"0.0"},{"v":0,"d":"0.0"},{"v":0,"d":"0.0"},{"v":0,"d":"0.0"},{"v":0,"d":"0.0"},{"v":0,"d":"0.0"},{"v":0,"d":"0.0"},{"v":0,"d":"0.0"},{"v":0,"d":"0.0"},{"v":0,"d":"0.0"},{"v":0,"d":"0.0"},{"v":0,"d":"0.0"},{"v":0,"d":"0.0"},{"v":0,"d":"0.0"},"HC","HC"]
["Итоговый показатель по группе",null,{"$f":"SUM(C8:C35)/дети!G2","v":{"$error":"#DIV/0!"}},{"$f":"SUM(D8:D35)/дети!G2","v":{"$error":"#DIV/0!"}},{"$f":"SUM(E8:E35)/дети!G2","v":{"$error":"#DIV/0!"}},{"$f":"SUM(F8:F35)/дети!G2","v":{"$error":"#DIV/0!"}},{"$f":"SUM(G8:G35)/дети!G2","v":{"$error":"#DIV/0!"}},{"$f":"SUM(H8:H35)/дети!G2","v":{"$error":"#DIV/0!"}},{"$f":"SUM(I8:I35)/дети!G2","v":{"$error":"#DIV/0!"}},{"$f":"SUM(J8:J35)/дети!G2","v":{"$error":"#DIV/0!"}},{"$f":"SUM(K8:K35)/дети!G2","v":{"$error":"#DIV/0!"}},{"$f":"SUM(L8:L35)/дети!G2","v":{"$error":"#DIV/0!"}},{"$f":"SUM(M8:M35)/дети!G2","v":{"$error":"#DIV/0!"}},{"$f":"SUM(N8:N35)/дети!G2","v":{"$error":"#DIV/0!"}},{"$f":"(C36+E36+G36+I36+K36+M36)/6","v":{"$error":"#DIV/0!"}},{"$f":"SUM(P8:P35)/дети!G2","v":{"$error":"#DIV/0!"}}]
[null,"\"3\" Сформирован (В)",{"$f":"COUNTIF(C8:C35,\"=3\")/дети!G2","v":{"$error":"#DIV/0!"}},{"$f":"COUNTIF(D8:D35,\"=3\")/дети!G2","v":{"$error":"#DIV/0!"}},{"$f":"COUNTIF(E8:E35,\"=3\")/дети!G2","v":{"$error":"#DIV/0!"}},{"$f":"COUNTIF(F8:F35,\"=3\")/дети!G2","v":{"$error":"#DIV/0!"}},{"$f":"COUNTIF(G8:G35,\"=3\")/дети!G2","v":{"$error":"#DIV/0!"}},{"$f":"COUNTIF(H8:H35,\"=3\")/дети!G2","v":{"$error":"#DIV/0!"}},{"$f":"COUNTIF(I8:I35,\"=3\")/дети!G2","v":{"$error":"#DIV/0!"}},{"$f":"COUNTIF(J8:J35,\"=3\")/дети!G2","v":{"$error":"#DIV/0!"}},{"$f":"COUNTIF(K8:K35,\"=3\")/дети!G2","v":{"$error":"#DIV/0!"}},{"$f":"COUNTIF(L8:L35,\"=3\")/дети!G2","v":{"$error":"#DIV/0!"}},{"$f":"COUNTIF(M8:M35,\"=3\")/дети!G2","v":{"$error":"#DIV/0!"}},{"$f":"COUNTIF(N8:N35,\"=3\")/дети!G2","v":{"$error":"#DIV/0!"}},{"$f":"COUNTIF(O8:O35,\"=3\")/дети!G2","v":{"$error":"#DIV/0!"}},{"$f":"COUNTIF(P8:P35,\"=3\")/дети!G2","v":{"$error":"#DIV/0!"}}]
[null,"\"2\" Находится в стадии формирования (С)",{"$f":"100%-(C39+C37)","v":{"$error":"#DIV/0!"}},{"$error":"#DIV/0!"},{"$error":"#DIV/0!"},{"$error":"#DIV/0!"},{"$error":"#DIV/0!"},{"$error":"#DIV/0!"},{"$error":"#DIV/0!"},{"$error":"#DIV/0!"},{"$error":"#DIV/0!"},{"$error":"#DIV/0!"},{"$error":"#DIV/0!"},{"$error":"#DIV/0!"},{"$f":"100%-(O39+O37)","v":{"$error":"#DIV/0!"}},{"$f":"100%-(P39+P37)","v":{"$error":"#DIV/0!"}}]
[null,"\"1\" Не сформирован (НС)",{"$f":"COUNTIF(C8:C35,\"<2\")/дети!G2","v":{"$error":"#DIV/0!"}},{"$f":"COUNTIF(D8:D35,\"<2\")/дети!G2","v":{"$error":"#DIV/0!"}},{"$f":"COUNTIF(E8:E35,\"<2\")/дети!G2","v":{"$error":"#DIV/0!"}},{"$f":"COUNTIF(F8:F35,\"<2\")/дети!G2","v":{"$error":"#DIV/0!"}},{"$f":"COUNTIF(G8:G35,\"<2\")/дети!G2","v":{"$error":"#DIV/0!"}},{"$f":"COUNTIF(H8:H35,\"<2\")/дети!G2","v":{"$error":"#DIV/0!"}},{"$f":"COUNTIF(I8:I35,\"<2\")/дети!G2","v":{"$error":"#DIV/0!"}},{"$f":"COUNTIF(J8:J35,\"<2\")/дети!G2","v":{"$error":"#DIV/0!"}},{"$f":"COUNTIF(K8:K35,\"<2\")/дети!G2","v":{"$error":"#DIV/0!"}},{"$f":"COUNTIF(L8:L35,\"<2\")/дети!G2","v":{"$error":"#DIV/0!"}},{"$f":"COUNTIF(M8:M35,\"<2\")/дети!G2","v":{"$error":"#DIV/0!"}},{"$f":"COUNTIF(N8:N35,\"<2\")/дети!G2","v":{"$error":"#DIV/0!"}},{"$f":"COUNTIF(O8:O35,\"<2\")/дети!G2","v":{"$error":"#DIV/0!"}},{"$f":"COUNTIF(P8:P35,\"<2\")/дети!G2","v":{"$error":"#DIV/0!"}}]

{"sheet":"физкультура","index":1,"n_rows":38,"n_cols":20,"rows_kept":38,"merged":[[4,0,5,0],[4,1,5,1],[4,2,4,3],[4,4,4,5],[4,6,4,7],[4,8,4,9],[4,10,4,11],[4,12,4,13],[4,14,4,15],[4,16,4,17],[4,18,4,19],[34,0,34,1]]}
[null,{"$f":"дети!A38","v":"Мониторинг образовательного процесса группы № __  (младшая) на 20__-20__ уч.г."}]
[{"$f":"дети!A39","v":"Воспитатель: _____________________________"}]
[{"$f":"дети!A40","v":"Воспитатель: ________________________________"}]
[null,null,"Мониторинг знаний  3-4 л. по образовательной области «Физкультура» "]
["№ п/п","Фамилия, имя ребенка","Соблюдает элементарные правила гигиены и правила приема пищи",null,"Умеет ходить прямо, не шаркая ногами, сохраняя заданное воспитателем направление.",null,"Умеет бегать, сохраняя равновесие, изменяя направление, темп бега в соответствии с указаниями воспитателя",null,"Сохраняет равновесие при ходьбе и беге по ограниченной плоскости, при перешагивании через предметы.",null,"Может ползать на четвереньках, лазать по лесенке-стремянке, гимнастической стенке произвольным способом.",null,"Энергично отталкивается в прыжках на двух ногах, прыгает в длину с места не менее чем на 40 см.",null,"Катает мяч в заданном направлении с расстояния, может бросать мяч двумя руками от груди, из-за головы; ударять мячом об пол, бросать его вверх 2-3 раза подряд и ловить метать предметы правой и левой рукой на расстояние не менее 5 м.",null,"Итоговый показатель по каждому ребенку (ср. значение)",null,"Уровень"]
[null,null,"н.г.","к.г.","н.г.","к.г.","н.г.","к.г.","н.г.","к.г.","н.г.","к.г.","н.г.","к.г.","н.г.","к.г.","н.г.","к.г.","н.г.","к.г."]
[1,{"$f":"дети!A1","v":0},{"v":0,"d":"0.0"},{"v":0,"d":"0.0"},{"v":0,"d":"0.0"},{"v":0,"d":"0.0"},{"v":0,"d":"0.0"},{"v":0,"d":"0.0"},{"v":0,"d":"0.0"},{"v":0,"d":"0.0"},{"v":0,"d":"0.0"},{"v":0,"d":"0.0"},{"v":0,"d":"0.0"},{"v":0,"d":"0.0"},{"v":0,"d":"0.0"},{"v":0,"d":"0.0"},{"$f":"(C7+E7+G7+I7+K7+M7+O7)/7","v":{"v":0,"d":"0.0"}},{"$f":"(D7+F7+H7+J7+L7+N7+P7)/7","v":{"v":0,"d":"0.0"}},{"$f":"IF(Q7=3,\"B\",IF(Q7>=2,\"C\",\"HC\"))","v":"HC"},{"$f":"IF(R7=3,\"B\",IF(R7>=2,\"C\",\"HC\"))","v":"HC"}]
[2,{"$f":"дети!A2","v":0},{"v":0,"d":"0.0"},{"v":0,"d":"0.0"},{"v":0,"d":"0.0"},{"v":0,"d":"0.0"},{"v":0,"d":"0.0"},{"v":0,"d":"0.0"},{"v":0,"d":"0.0"},{"v":0,"d":"0.0"},{"v":0,"d":"0.0"},{"v":0,"d":"0.0"},{"v":0,"d":"0.0"},{"v":0,"d":"0.0"},{"v":0,"d":"0.0"},{"v":0,"d":"0.0"},{"$f":"(C8+E8+G8+I8+K8+M8+O8)/7","v":{"v":0,"d":"0.0"}},{"$f":"(D8+F8+H8+J8+L8+N8+P8)/7","v":{"v":0,"d":"0.0"}},{"$f":"IF(Q8=3,\"B\",IF(Q8>=2,\"C\",\"HC\"))","v":"HC"},{"$f":"IF(R8=3,\"B\",IF(R8>=2,\"C\",\"HC\"))","v":"HC"}]
[3,{"$f":"дети!A3","v":0},{"v":0,"d":"0.0"},{"v":0,"d":"0.0"},{"v":0,"d":"0.0"},{"v":0,"d":"0.0"},{"v":0,"d":"0.0"},{"v":0,"d":"0.0"},{"v":0,"d":"0.0"},{"v":0,"d":"0.0"},{"v":0,"d":"0.0"},{"v":0,"d":"0.0"},{"v":0,"d":"0.0"},{"v":0,"d":"0.0"},{"v":0,"d":"0.0"},{"v":0,"d":"0.0"},{"v":0,"d":"0.0"},{"v":0,"d":"0.0"},"HC","HC"]
[4,{"$f":"дети!A4","v":0},{"v":0,"d":"0.0"},{"v":0,"d":"0.0"},{"v":0,"d":"0.0"},{"v":0,"d":"0.0"},{"v":0,"d":"0.0"},{"v":0,"d":"0.0"},{"v":0,"d":"0.0"},{"v":0,"d":"0.0"},{"v":0,"d":"0.0"},{"v":0,"d":"0.0"},{"v":0,"d":"0.0"},{"v":0,"d":"0.0"},{"v":0,"d":"0.0"},{"v":0,"d":"0.0"},{"v":0,"d":"0.0"},{"v":0,"d":"0.0"},"HC","HC"]
[5,{"$f":"дети!A5","v":0},{"v":0,"d":"0.0"},{"v":0,"d":"0.0"},{"v":0,"d":"0.0"},{"v":0,"d":"0.0"},{"v":0,"d":"0.0"},{"v":0,"d":"0.0"},{"v":0,"d":"0.0"},{"v":0,"d":"0.0"},{"v":0,"d":"0.0"},{"v":0,"d":"0.0"},{"v":0,"d":"0.0"},{"v":0,"d":"0.0"},{"v":0,"d":"0.0"},{"v":0,"d":"0.0"},{"v":0,"d":"0.0"},{"v":0,"d":"0.0"},"HC","HC"]
[6,{"$f":"дети!A6","v":0},{"v":0,"d":"0.0"},{"v":0,"d":"0.0"},{"v":0,"d":"0.0"},{"v":0,"d":"0.0"},{"v":0,"d":"0.0"},{"v":0,"d":"0.0"},{"v":0,"d":"0.0"},{"v":0,"d":"0.0"},{"v":0,"d":"0.0"},{"v":0,"d":"0.0"},{"v":0,"d":"0.0"},{"v":0,"d":"0.0"},{"v":0,"d":"0.0"},{"v":0,"d":"0.0"},{"v":0,"d":"0.0"},{"v":0,"d":"0.0"},"HC","HC"]
[7,{"$f":"дети!A7","v":0},{"v":0,"d":"0.0"},{"v":0,"d":"0.0"},{"v":0,"d":"0.0"},{"v":0,"d":"0.0"},{"v":0,"d":"0.0"},{"v":0,"d":"0.0"},{"v":0,"d":"0.0"},{"v":0,"d":"0.0"},{"v":0,"d":"0.0"},{"v":0,"d":"0.0"},{"v":0,"d":"0.0"},{"v":0,"d":"0.0"},{"v":0,"d":"0.0"},{"v":0,"d":"0.0"},{"v":0,"d":"0.0"},{"v":0,"d":"0.0"},"HC","HC"]
[8,{"$f":"дети!A8","v":0},{"v":0,"d":"0.0"},{"v":0,"d":"0.0"},{"v":0,"d":"0.0"},{"v":0,"d":"0.0"},{"v":0,"d":"0.0"},{"v":0,"d":"0.0"},{"v":0,"d":"0.0"},{"v":0,"d":"0.0"},{"v":0,"d":"0.0"},{"v":0,"d":"0.0"},{"v":0,"d":"0.0"},{"v":0,"d":"0.0"},{"v":0,"d":"0.0"},{"v":0,"d":"0.0"},{"v":0,"d":"0.0"},{"v":0,"d":"0.0"},"HC","HC"]
[9,{"$f":"дети!A9","v":0},{"v":0,"d":"0.0"},{"v":0,"d":"0.0"},{"v":0,"d":"0.0"},{"v":0,"d":"0.0"},{"v":0,"d":"0.0"},{"v":0,"d":"0.0"},{"v":0,"d":"0.0"},{"v":0,"d":"0.0"},{"v":0,"d":"0.0"},{"v":0,"d":"0.0"},{"v":0,"d":"0.0"},{"v":0,"d":"0.0"},{"v":0,"d":"0.0"},{"v":0,"d":"0.0"},{"v":0,"d":"0.0"},{"v":0,"d":"0.0"},"HC","HC"]
[10,{"$f":"дети!A10","v":0},{"v":0,"d":"0.0"},{"v":0,"d":"0.0"},{"v":0,"d":"0.0"},{"v":0,"d":"0.0"},{"v":0,"d":"0.0"},{"v":0,"d":"0.0"},{"v":0,"d":"0.0"},{"v":0,"d":"0.0"},{"v":0,"d":"0.0"},{"v":0,"d":"0.0"},{"v":0,"d":"0.0"},{"v":0,"d":"0.0"},{"v":0,"d":"0.0"},{"v":0,"d":"0.0"},{"v":0,"d":"0.0"},{"v":0,"d":"0.0"},"HC","HC"]
[11,{"$f":"дети!A11","v":0},{"v":0,"d":"0.0"},{"v":0,"d":"0.0"},{"v":0,"d":"0.0"},{"v":0,"d":"0.0"},{"v":0,"d":"0.0"},{"v":0,"d":"0.0"},{"v":0,"d":"0.0"},{"v":0,"d":"0.0"},{"v":0,"d":"0.0"},{"v":0,"d":"0.0"},{"v":0,"d":"0.0"},{"v":0,"d":"0.0"},{"v":0,"d":"0.0"},{"v":0,"d":"0.0"},{"v":0,"d":"0.0"},{"v":0,"d":"0.0"},"HC","HC"]
[12,{"$f":"дети!A12","v":0},{"v":0,"d":"0.0"},{"v":0,"d":"0.0"},{"v":0,"d":"0.0"},{"v":0,"d":"0.0"},{"v":0,"d":"0.0"},{"v":0,"d":"0.0"},{"v":0,"d":"0.0"},{"v":0,"d":"0.0"},{"v":0,"d":"0.0"},{"v":0,"d":"0.0"},{"v":0,"d":"0.0"},{"v":0,"d":"0.0"},{"v":0,"d":"0.0"},{"v":0,"d":"0.0"},{"v":0,"d":"0.0"},{"v":0,"d":"0.0"},"HC","HC"]
[13,{"$f":"дети!A13","v":0},{"v":0,"d":"0.0"},{"v":0,"d":"0.0"},{"v":0,"d":"0.0"},{"v":0,"d":"0.0"},{"v":0,"d":"0.0"},{"v":0,"d":"0.0"},{"v":0,"d":"0.0"},{"v":0,"d":"0.0"},{"v":0,"d":"0.0"},{"v":0,"d":"0.0"},{"v":0,"d":"0.0"},{"v":0,"d":"0.0"},{"v":0,"d":"0.0"},{"v":0,"d":"0.0"},{"v":0,"d":"0.0"},{"v":0,"d":"0.0"},"HC","HC"]
[14,{"$f":"дети!A14","v":0},{"v":0,"d":"0.0"},{"v":0,"d":"0.0"},{"v":0,"d":"0.0"},{"v":0,"d":"0.0"},{"v":0,"d":"0.0"},{"v":0,"d":"0.0"},{"v":0,"d":"0.0"},{"v":0,"d":"0.0"},{"v":0,"d":"0.0"},{"v":0,"d":"0.0"},{"v":0,"d":"0.0"},{"v":0,"d":"0.0"},{"v":0,"d":"0.0"},{"v":0,"d":"0.0"},{"v":0,"d":"0.0"},{"v":0,"d":"0.0"},"HC","HC"]
[15,{"$f":"дети!A15","v":0},{"v":0,"d":"0.0"},{"v":0,"d":"0.0"},{"v":0,"d":"0.0"},{"v":0,"d":"0.0"},{"v":0,"d":"0.0"},{"v":0,"d":"0.0"},{"v":0,"d":"0.0"},{"v":0,"d":"0.0"},{"v":0,"d":"0.0"},{"v":0,"d":"0.0"},{"v":0,"d":"0.0"},{"v":0,"d":"0.0"},{"v":0,"d":"0.0"},{"v":0,"d":"0.0"},{"v":0,"d":"0.0"},{"v":0,"d":"0.0"},"HC","HC"]
[16,{"$f":"дети!A16","v":0},{"v":0,"d":"0.0"},{"v":0,"d":"0.0"},{"v":0,"d":"0.0"},{"v":0,"d":"0.0"},{"v":0,"d":"0.0"},{"v":0,"d":"0.0"},{"v":0,"d":"0.0"},{"v":0,"d":"0.0"},{"v":0,"d":"0.0"},{"v":0,"d":"0.0"},{"v":0,"d":"0.0"},{"v":0,"d":"0.0"},{"v":0,"d":"0.0"},{"v":0,"d":"0.0"},{"v":0,"d":"0.0"},{"v":0,"d":"0.0"},"HC","HC"]
[17,{"$f":"дети!A17","v":0},{"v":0,"d":"0.0"},{"v":0,"d":"0.0"},{"v":0,"d":"0.0"},{"v":0,"d":"0.0"},{"v":0,"d":"0.0"},{"v":0,"d":"0.0"},{"v":0,"d":"0.0"},{"v":0,"d":"0.0"},{"v":0,"d":"0.0"},{"v":0,"d":"0.0"},{"v":0,"d":"0.0"},{"v":0,"d":"0.0"},{"v":0,"d":"0.0"},{"v":0,"d":"0.0"},{"v":0,"d":"0.0"},{"v":0,"d":"0.0"},"HC","HC"]
[18,{"$f":"дети!A18","v":0},{"v":0,"d":"0.0"},{"v":0,"d":"0.0"},{"v":0,"d":"0.0"},{"v":0,"d":"0.0"},{"v":0,"d":"0.0"},{"v":0,"d":"0.0"},{"v":0,"d":"0.0"},{"v":0,"d":"0.0"},{"v":0,"d":"0.0"},{"v":0,"d":"0.0"},{"v":0,"d":"0.0"},{"v":0,"d":"0.0"},{"v":0,"d":"0.0"},{"v":0,"d":"0.0"},{"v":0,"d":"0.0"},{"v":0,"d":"0.0"},"HC","HC"]
[19,{"$f":"дети!A19","v":0},{"v":0,"d":"0.0"},{"v":0,"d":"0.0"},{"v":0,"d":"0.0"},{"v":0,"d":"0.0"},{"v":0,"d":"0.0"},{"v":0,"d":"0.0"},{"v":0,"d":"0.0"},{"v":0,"d":"0.0"},{"v":0,"d":"0.0"},{"v":0,"d":"0.0"},{"v":0,"d":"0.0"},{"v":0,"d":"0.0"},{"v":0,"d":"0.0"},{"v":0,"d":"0.0"},{"v":0,"d":"0.0"},{"v":0,"d":"0.0"},"HC","HC"]
[20,{"$f":"дети!A20","v":0},{"v":0,"d":"0.0"},{"v":0,"d":"0.0"},{"v":0,"d":"0.0"},{"v":0,"d":"0.0"},{"v":0,"d":"0.0"},{"v":0,"d":"0.0"},{"v":0,"d":"0.0"},{"v":0,"d":"0.0"},{"v":0,"d":"0.0"},{"v":0,"d":"0.0"},{"v":0,"d":"0.0"},{"v":0,"d":"0.0"},{"v":0,"d":"0.0"},{"v":0,"d":"0.0"},{"v":0,"d":"0.0"},{"v":0,"d":"0.0"},"HC","HC"]
[21,{"$f":"дети!A21","v":0},{"v":0,"d":"0.0"},{"v":0,"d":"0.0"},{"v":0,"d":"0.0"},{"v":0,"d":"0.0"},{"v":0,"d":"0.0"},{"v":0,"d":"0.0"},{"v":0,"d":"0.0"},{"v":0,"d":"0.0"},{"v":0,"d":"0.0"},{"v":0,"d":"0.0"},{"v":0,"d":"0.0"},{"v":0,"d":"0.0"},{"v":0,"d":"0.0"},{"v":0,"d":"0.0"},{"v":0,"d":"0.0"},{"v":0,"d":"0.0"},"HC","HC"]
[22,{"$f":"дети!A22","v":0},{"v":0,"d":"0.0"},{"v":0,"d":"0.0"},{"v":0,"d":"0.0"},{"v":0,"d":"0.0"},{"v":0,"d":"0.0"},{"v":0,"d":"0.0"},{"v":0,"d":"0.0"},{"v":0,"d":"0.0"},{"v":0,"d":"0.0"},{"v":0,"d":"0.0"},{"v":0,"d":"0.0"},{"v":0,"d":"0.0"},{"v":0,"d":"0.0"},{"v":0,"d":"0.0"},{"v":0,"d":"0.0"},{"v":0,"d":"0.0"},"HC","HC"]
[23,{"$f":"дети!A23","v":0},{"v":0,"d":"0.0"},{"v":0,"d":"0.0"},{"v":0,"d":"0.0"},{"v":0,"d":"0.0"},{"v":0,"d":"0.0"},{"v":0,"d":"0.0"},{"v":0,"d":"0.0"},{"v":0,"d":"0.0"},{"v":0,"d":"0.0"},{"v":0,"d":"0.0"},{"v":0,"d":"0.0"},{"v":0,"d":"0.0"},{"v":0,"d":"0.0"},{"v":0,"d":"0.0"},{"v":0,"d":"0.0"},{"v":0,"d":"0.0"},"HC","HC"]
[24,{"$f":"дети!A24","v":0},{"v":0,"d":"0.0"},{"v":0,"d":"0.0"},{"v":0,"d":"0.0"},{"v":0,"d":"0.0"},{"v":0,"d":"0.0"},{"v":0,"d":"0.0"},{"v":0,"d":"0.0"},{"v":0,"d":"0.0"},{"v":0,"d":"0.0"},{"v":0,"d":"0.0"},{"v":0,"d":"0.0"},{"v":0,"d":"0.0"},{"v":0,"d":"0.0"},{"v":0,"d":"0.0"},{"v":0,"d":"0.0"},{"v":0,"d":"0.0"},"HC","HC"]
[25,{"$f":"дети!A25","v":0},{"v":0,"d":"0.0"},{"v":0,"d":"0.0"},{"v":0,"d":"0.0"},{"v":0,"d":"0.0"},{"v":0,"d":"0.0"},{"v":0,"d":"0.0"},{"v":0,"d":"0.0"},{"v":0,"d":"0.0"},{"v":0,"d":"0.0"},{"v":0,"d":"0.0"},{"v":0,"d":"0.0"},{"v":0,"d":"0.0"},{"v":0,"d":"0.0"},{"v":0,"d":"0.0"},{"v":0,"d":"0.0"},{"v":0,"d":"0.0"},"HC","HC"]
[26,{"$f":"дети!A26","v":0},{"v":0,"d":"0.0"},{"v":0,"d":"0.0"},{"v":0,"d":"0.0"},{"v":0,"d":"0.0"},{"v":0,"d":"0.0"},{"v":0,"d":"0.0"},{"v":0,"d":"0.0"},{"v":0,"d":"0.0"},{"v":0,"d":"0.0"},{"v":0,"d":"0.0"},{"v":0,"d":"0.0"},{"v":0,"d":"0.0"},{"v":0,"d":"0.0"},{"v":0,"d":"0.0"},{"v":0,"d":"0.0"},{"v":0,"d":"0.0"},"HC","HC"]
[27,{"$f":"дети!A27","v":0},{"v":0,"d":"0.0"},{"v":0,"d":"0.0"},{"v":0,"d":"0.0"},{"v":0,"d":"0.0"},{"v":0,"d":"0.0"},{"v":0,"d":"0.0"},{"v":0,"d":"0.0"},{"v":0,"d":"0.0"},{"v":0,"d":"0.0"},{"v":0,"d":"0.0"},{"v":0,"d":"0.0"},{"v":0,"d":"0.0"},{"v":0,"d":"0.0"},{"v":0,"d":"0.0"},{"v":0,"d":"0.0"},{"v":0,"d":"0.0"},"HC","HC"]
[28,{"$f":"дети!A28","v":0},{"v":0,"d":"0.0"},{"v":0,"d":"0.0"},{"v":0,"d":"0.0"},{"v":0,"d":"0.0"},{"v":0,"d":"0.0"},{"v":0,"d":"0.0"},{"v":0,"d":"0.0"},{"v":0,"d":"0.0"},{"v":0,"d":"0.0"},{"v":0,"d":"0.0"},{"v":0,"d":"0.0"},{"v":0,"d":"0.0"},{"v":0,"d":"0.0"},{"v":0,"d":"0.0"},{"v":0,"d":"0.0"},{"v":0,"d":"0.0"},"HC","HC"]
["Итоговый показатель по группе (среднее значение)",null,{"$f":"SUM(C7:C34)/дети!G2","v":{"$error":"#DIV/0!"}},{"$f":"SUM(D7:D34)/дети!G2","v":{"$error":"#DIV/0!"}},{"$f":"SUM(E7:E34)/дети!G2","v":{"$error":"#DIV/0!"}},{"$f":"SUM(F7:F33)/дети!G2","v":{"$error":"#DIV/0!"}},{"$f":"SUM(G7:G34)/дети!G2","v":{"$error":"#DIV/0!"}},{"$f":"SUM(H7:H33)/дети!G2","v":{"$error":"#DIV/0!"}},{"$f":"SUM(I7:I34)/дети!G2","v":{"$error":"#DIV/0!"}},{"$f":"SUM(J7:J33)/дети!G2","v":{"$error":"#DIV/0!"}},{"$f":"SUM(K7:K34)/дети!G2","v":{"$error":"#DIV/0!"}},{"$f":"SUM(L7:L33)/дети!G2","v":{"$error":"#DIV/0!"}},{"$f":"SUM(M7:M34)/дети!G2","v":{"$error":"#DIV/0!"}},{"$f":"SUM(N7:N33)/дети!G2","v":{"$error":"#DIV/0!"}},{"$f":"SUM(O7:O34)/дети!G2","v":{"$error":"#DIV/0!"}},{"$f":"SUM(P7:P33)/дети!G2","v":{"$error":"#DIV/0!"}},{"$f":"SUM(Q7:Q34)/дети!G2","v":{"$error":"#DIV/0!"}},{"$f":"SUM(R7:R34)/дети!G2","v":{"$error":"#DIV/0!"}}]
[null,"\"3\" Сформирован (В)",{"$f":"COUNTIF(C7:C34,\"=3\")/дети!G2","v":{"$error":"#DIV/0!"}},{"$f":"COUNTIF(D7:D33,\"=3\")/дети!G2","v":{"$error":"#DIV/0!"}},{"$f":"COUNTIF(E7:E34,\"=3\")/дети!G2","v":{"$error":"#DIV/0!"}},{"$f":"COUNTIF(F7:F33,\"=3\")/дети!G2","v":{"$error":"#DIV/0!"}},{"$f":"COUNTIF(G7:G34,\"=3\")/дети!G2","v":{"$error":"#DIV/0!"}},{"$f":"COUNTIF(H7:H33,\"=3\")/дети!G2","v":{"$error":"#DIV/0!"}},{"$f":"COUNTIF(I7:I34,\"=3\")/дети!G2","v":{"$error":"#DIV/0!"}},{"$f":"COUNTIF(J7:J33,\"=3\")/дети!G2","v":{"$error":"#DIV/0!"}},{"$f":"COUNTIF(K7:K34,\"=3\")/дети!G2","v":{"$error":"#DIV/0!"}},{"$f":"COUNTIF(L7:L33,\"=3\")/дети!G2","v":{"$error":"#DIV/0!"}},{"$f":"COUNTIF(M7:M34,\"=3\")/дети!G2","v":{"$error":"#DIV/0!"}},{"$f":"COUNTIF(N7:N33,\"=3\")/дети!G2","v":{"$error":"#DIV/0!"}},{"$f":"COUNTIF(O7:O34,\"=3\")/дети!G2","v":{"$error":"#DIV/0!"}},{"$f":"COUNTIF(P7:P33,\"=3\")/дети!G2","v":{"$error":"#DIV/0!"}},{"$f":"COUNTIF(Q7:Q34,\"=3\")/дети!G2","v":{"$error":"#DIV/0!"}},{"$f":"COUNTIF(R7:R34,\"=3\")/дети!G2","v":{"$error":"#DIV/0!"}}]
[null,"\"2\" Находится в стадии формирования (С)",{"$f":"COUNTIF(C7:C34,\"=2\")/дети!G2","v":{"$error":"#DIV/0!"}},{"$f":"COUNTIF(D7:D33,\"=2\")/дети!G2","v":{"$error":"#DIV/0!"}},{"$f":"COUNTIF(E7:E34,\"=2\")/дети!G2","v":{"$error":"#DIV/0!"}},{"$f":"COUNTIF(F7:F33,\"=2\")/дети!G2","v":{"$error":"#DIV/0!"}},{"$f":"COUNTIF(G7:G34,\"=2\")/дети!G2","v":{"$error":"#DIV/0!"}},{"$f":"COUNTIF(H7:H33,\"=2\")/дети!G2","v":{"$error":"#DIV/0!"}},{"$f":"COUNTIF(I7:I34,\"=2\")/дети!G2","v":{"$error":"#DIV/0!"}},{"$f":"COUNTIF(J7:J33,\"=2\")/дети!G2","v":{"$error":"#DIV/0!"}},{"$f":"COUNTIF(K7:K34,\"=2\")/дети!G2","v":{"$error":"#DIV/0!"}},{"$f":"COUNTIF(L7:L33,\"=2\")/дети!G2","v":{"$error":"#DIV/0!"}},{"$f":"COUNTIF(M7:M34,\"=2\")/дети!G2","v":{"$error":"#DIV/0!"}},{"$f":"COUNTIF(N7:N33,\"=2\")/дети!G2","v":{"$error":"#DIV/0!"}},{"$f":"COUNTIF(O7:O34,\"=2\")/дети!G2","v":{"$error":"#DIV/0!"}},{"$f":"COUNTIF(P7:P33,\"=2\")/дети!G2","v":{"$error":"#DIV/0!"}},{"$f":"100%-(Q38+Q36)","v":{"$error":"#DIV/0!"}},{"$f":"100%-(R38+R36)","v":{"$error":"#DIV/0!"}}]
[null,"\"1\" Не сформирован (НС)",{"$f":"COUNTIF(C7:C34,\"=1\")/дети!G2","v":{"$error":"#DIV/0!"}},{"$f":"COUNTIF(D7:D33,\"=1\")/дети!G2","v":{"$error":"#DIV/0!"}},{"$f":"COUNTIF(E7:E34,\"=1\")/дети!G2","v":{"$error":"#DIV/0!"}},{"$f":"COUNTIF(F7:F33,\"=1\")/дети!G2","v":{"$error":"#DIV/0!"}},{"$f":"COUNTIF(G7:G34,\"=1\")/дети!G2","v":{"$error":"#DIV/0!"}},{"$f":"COUNTIF(H7:H33,\"=1\")/дети!G2","v":{"$error":"#DIV/0!"}},{"$f":"COUNTIF(I7:I34,\"=1\")/дети!G2","v":{"$error":"#DIV/0!"}},{"$f":"COUNTIF(J7:J33,\"=1\")/дети!G2","v":{"$error":"#DIV/0!"}},{"$f":"COUNTIF(K7:K34,\"=1\")/дети!G2","v":{"$error":"#DIV/0!"}},{"$f":"COUNTIF(L7:L33,\"=1\")/дети!G2","v":{"$error":"#DIV/0!"}},{"$f":"COUNTIF(M7:M34,\"=1\")/дети!G2","v":{"$error":"#DIV/0!"}},{"$f":"COUNTIF(N7:N33,\"=1\")/дети!G2","v":{"$error":"#DIV/0!"}},{"$f":"COUNTIF(O7:O34,\"=1\")/дети!G2","v":{"$error":"#DIV/0!"}},{"$f":"COUNTIF(P7:P33,\"=1\")/дети!G2","v":{"$error":"#DIV/0!"}},{"$f":"COUNTIF(Q7:Q34,\"<2\")/дети!G2","v":{"$error":"#DIV/0!"}},{"$f":"COUNTIF(R7:R34,\"<2\")/дети!G2","v":{"$error":"#DIV/0!"}}]

{"sheet":"соц-ком","index":2,"n_rows":39,"n_cols":20,"rows_kept":39,"merged":[[4,0,6,0],[4,1,6,1],[4,2,5,3],[4,4,5,5],[4,6,5,7],[4,8,5,9],[4,10,5,11],[4,12,5,13],[4,14,5,15],[4,16,5,17],[4,18,5,19],[35,0,35,1]]}
[null,{"$f":"дети!A38","v":"Мониторинг образовательного процесса группы № __  (младшая) на 20__-20__ уч.г."}]
[{"$f":"дети!A39","v":"Воспитатель: _____________________________"}]
[{"$f":"дети!A40","v":"Воспитатель: ________________________________"}]
[null,null,"Мониторинг знаний 3-4 л.  по образовательной области «Социально-коммуникативное развитие»  "]
["№ п/ п","Фамилия, имя ребенка","Старается соблюдать правила поведения в общественных  местах, в общении со взрослыми и  сверстниками, в природе",null,"Понимает  социальную  оценку  поступков сверстников или героев литературных  произведений",null,"Имитирует        мимику, движения,     интонацию героев      литературных произведений",null,"Принимает на себя роль, объединяет     несколько игровых действий в единую сюжетную линию",null,"Способен  придерживаться игровых правил в дидактических играх",null,"Разыгрывает    самостоятельно   и   по   просьбе взрослого   отрывки   из знакомых сказок",null,"Имеет элементарные представления о правилах дорожного движения.",null,"Итоговый показатель по каждому ребенку ",null,"Уровень"]
[]
[null,null,"н.г.","к.г.","н.г.","к.г.","н.г.","к.г.","н.г.","к.г.","н.г.","к.г.","н.г.","к.г.","н.г.","к.г.","н.г.","к.г.","н.г.","к.г."]
[1,{"$f":"дети!A1","v":0},{"v":0,"d":"0.0"},{"v":0,"d":"0.0"},{"v":0,"d":"0.0"},{"v":0,"d":"0.0"},{"v":0,"d":"0.0"},{"v":0,"d":"0.0"},{"v":0,"d":"0.0"},{"v":0,"d":"0.0"},{"v":0,"d":"0.0"},{"v":0,"d":"0.0"},{"v":0,"d":"0.0"},{"v":0,"d":"0.0"},{"v":0,"d":"0.0"},{"v":0,"d":"0.0"},{"$f":"(C8+E8+G8+I8+K8+M8+O8)/7","v":{"v":0,"d":"0.0"}},{"$f":"(D8+F8+H8+J8+L8+N8+P8)/7","v":{"v":0,"d":"0.0"}},{"$f":"IF(Q8=3,\"B\",IF(Q8>=2,\"C\",\"HC\"))","v":"HC"},{"$f":"IF(R8=3,\"B\",IF(R8>=2,\"C\",\"HC\"))","v":"HC"}]
[2,{"$f":"дети!A2","v":0},{"v":0,"d":"0.0"},{"v":0,"d":"0.0"},{"v":0,"d":"0.0"},{"v":0,"d":"0.0"},{"v":0,"d":"0.0"},{"v":0,"d":"0.0"},{"v":0,"d":"0.0"},{"v":0,"d":"0.0"},{"v":0,"d":"0.0"},{"v":0,"d":"0.0"},{"v":0,"d":"0.0"},{"v":0,"d":"0.0"},{"v":0,"d":"0.0"},{"v":0,"d":"0.0"},{"$f":"(C9+E9+G9+I9+K9+M9+O9)/7","v":{"v":0,"d":"0.0"}},{"$f":"(D9+F9+H9+J9+L9+N9+P9)/7","v":{"v":0,"d":"0.0"}},{"$f":"IF(Q9=3,\"B\",IF(Q9>=2,\"C\",\"HC\"))","v":"HC"},{"$f":"IF(R9=3,\"B\",IF(R9>=2,\"C\",\"HC\"))","v":"HC"}]
[3,{"$f":"дети!A3","v":0},{"v":0,"d":"0.0"},{"v":0,"d":"0.0"},{"v":0,"d":"0.0"},{"v":0,"d":"0.0"},{"v":0,"d":"0.0"},{"v":0,"d":"0.0"},{"v":0,"d":"0.0"},{"v":0,"d":"0.0"},{"v":0,"d":"0.0"},{"v":0,"d":"0.0"},{"v":0,"d":"0.0"},{"v":0,"d":"0.0"},{"v":0,"d":"0.0"},{"v":0,"d":"0.0"},{"v":0,"d":"0.0"},{"v":0,"d":"0.0"},"HC","HC"]
[4,{"$f":"дети!A4","v":0},{"v":0,"d":"0.0"},{"v":0,"d":"0.0"},{"v":0,"d":"0.0"},{"v":0,"d":"0.0"},{"v":0,"d":"0.0"},{"v":0,"d":"0.0"},{"v":0,"d":"0.0"},{"v":0,"d":"0.0"},{"v":0,"d":"0.0"},{"v":0,"d":"0.0"},{"v":0,"d":"0.0"},{"v":0,"d":"0.0"},{"v":0,"d":"0.0"},{"v":0,"d":"0.0"},{"v":0,"d":"0.0"},{"v":0,"d":"0.0"},"HC","HC"]
[5,{"$f":"дети!A5","v":0},{"v":0,"d":"0.0"},{"v":0,"d":"0.0"},{"v":0,"d":"0.0"},{"v":0,"d":"0.0"},{"v":0,"d":"0.0"},{"v":0,"d":"0.0"},{"v":0,"d":"0.0"},{"v":0,"d":"0.0"},{"v":0,"d":"0.0"},{"v":0,"d":"0.0"},{"v":0,"d":"0.0"},{"v":0,"d":"0.0"},{"v":0,"d":"0.0"},{"v":0,"d":"0.0"},{"v":0,"d":"0.0"},{"v":0,"d":"0.0"},"HC","HC"]
[6,{"$f":"дети!A6","v":0},{"v":0,"d":"0.0"},{"v":0,"d":"0.0"},{"v":0,"d":"0.0"},{"v":0,"d":"0.0"},{"v":0,"d":"0.0"},{"v":0,"d":"0.0"},{"v":0,"d":"0.0"},{"v":0,"d":"0.0"},{"v":0,"d":"0.0"},{"v":0,"d":"0.0"},{"v":0,"d":"0.0"},{"v":0,"d":"0.0"},{"v":0,"d":"0.0"},{"v":0,"d":"0.0"},{"v":0,"d":"0.0"},{"v":0,"d":"0.0"},"HC","HC"]
[7,{"$f":"дети!A7","v":0},{"v":0,"d":"0.0"},{"v":0,"d":"0.0"},{"v":0,"d":"0.0"},{"v":0,"d":"0.0"},{"v":0,"d":"0.0"},{"v":0,"d":"0.0"},{"v":0,"d":"0.0"},{"v":0,"d":"0.0"},{"v":0,"d":"0.0"},{"v":0,"d":"0.0"},{"v":0,"d":"0.0"},{"v":0,"d":"0.0"},{"v":0,"d":"0.0"},{"v":0,"d":"0.0"},{"v":0,"d":"0.0"},{"v":0,"d":"0.0"},"HC","HC"]
[8,{"$f":"дети!A8","v":0},{"v":0,"d":"0.0"},{"v":0,"d":"0.0"},{"v":0,"d":"0.0"},{"v":0,"d":"0.0"},{"v":0,"d":"0.0"},{"v":0,"d":"0.0"},{"v":0,"d":"0.0"},{"v":0,"d":"0.0"},{"v":0,"d":"0.0"},{"v":0,"d":"0.0"},{"v":0,"d":"0.0"},{"v":0,"d":"0.0"},{"v":0,"d":"0.0"},{"v":0,"d":"0.0"},{"v":0,"d":"0.0"},{"v":0,"d":"0.0"},"HC","HC"]
[9,{"$f":"дети!A9","v":0},{"v":0,"d":"0.0"},{"v":0,"d":"0.0"},{"v":0,"d":"0.0"},{"v":0,"d":"0.0"},{"v":0,"d":"0.0"},{"v":0,"d":"0.0"},{"v":0,"d":"0.0"},{"v":0,"d":"0.0"},{"v":0,"d":"0.0"},{"v":0,"d":"0.0"},{"v":0,"d":"0.0"},{"v":0,"d":"0.0"},{"v":0,"d":"0.0"},{"v":0,"d":"0.0"},{"v":0,"d":"0.0"},{"v":0,"d":"0.0"},"HC","HC"]
[10,{"$f":"дети!A10","v":0},{"v":0,"d":"0.0"},{"v":0,"d":"0.0"},{"v":0,"d":"0.0"},{"v":0,"d":"0.0"},{"v":0,"d":"0.0"},{"v":0,"d":"0.0"},{"v":0,"d":"0.0"},{"v":0,"d":"0.0"},{"v":0,"d":"0.0"},{"v":0,"d":"0.0"},{"v":0,"d":"0.0"},{"v":0,"d":"0.0"},{"v":0,"d":"0.0"},{"v":0,"d":"0.0"},{"v":0,"d":"0.0"},{"v":0,"d":"0.0"},"HC","HC"]
[11,{"$f":"дети!A11","v":0},{"v":0,"d":"0.0"},{"v":0,"d":"0.0"},{"v":0,"d":"0.0"},{"v":0,"d":"0.0"},{"v":0,"d":"0.0"},{"v":0,"d":"0.0"},{"v":0,"d":"0.0"},{"v":0,"d":"0.0"},{"v":0,"d":"0.0"},{"v":0,"d":"0.0"},{"v":0,"d":"0.0"},{"v":0,"d":"0.0"},{"v":0,"d":"0.0"},{"v":0,"d":"0.0"},{"v":0,"d":"0.0"},{"v":0,"d":"0.0"},"HC","HC"]
[12,{"$f":"дети!A12","v":0},{"v":0,"d":"0.0"},{"v":0,"d":"0.0"},{"v":0,"d":"0.0"},{"v":0,"d":"0.0"},{"v":0,"d":"0.0"},{"v":0,"d":"0.0"},{"v":0,"d":"0.0"},{"v":0,"d":"0.0"},{"v":0,"d":"0.0"},{"v":0,"d":"0.0"},{"v":0,"d":"0.0"},{"v":0,"d":"0.0"},{"v":0,"d":"0.0"},{"v":0,"d":"0.0"},{"v":0,"d":"0.0"},{"v":0,"d":"0.0"},"HC","HC"]
[13,{"$f":"дети!A13","v":0},{"v":0,"d":"0.0"},{"v":0,"d":"0.0"},{"v":0,"d":"0.0"},{"v":0,"d":"0.0"},{"v":0,"d":"0.0"},{"v":0,"d":"0.0"},{"v":0,"d":"0.0"},{"v":0,"d":"0.0"},{"v":0,"d":"0.0"},{"v":0,"d":"0.0"},{"v":0,"d":"0.0"},{"v":0,"d":"0.0"},{"v":0,"d":"0.0"},{"v":0,"d":"0.0"},{"v":0,"d":"0.0"},{"v":0,"d":"0.0"},"HC","HC"]
[14,{"$f":"дети!A14","v":0},{"v":0,"d":"0.0"},{"v":0,"d":"0.0"},{"v":0,"d":"0.0"},{"v":0,"d":"0.0"},{"v":0,"d":"0.0"},{"v":0,"d":"0.0"},{"v":0,"d":"0.0"},{"v":0,"d":"0.0"},{"v":0,"d":"0.0"},{"v":0,"d":"0.0"},{"v":0,"d":"0.0"},{"v":0,"d":"0.0"},{"v":0,"d":"0.0"},{"v":0,"d":"0.0"},{"v":0,"d":"0.0"},{"v":0,"d":"0.0"},"HC","HC"]
[15,{"$f":"дети!A15","v":0},{"v":0,"d":"0.0"},{"v":0,"d":"0.0"},{"v":0,"d":"0.0"},{"v":0,"d":"0.0"},{"v":0,"d":"0.0"},{"v":0,"d":"0.0"},{"v":0,"d":"0.0"},{"v":0,"d":"0.0"},{"v":0,"d":"0.0"},{"v":0,"d":"0.0"},{"v":0,"d":"0.0"},{"v":0,"d":"0.0"},{"v":0,"d":"0.0"},{"v":0,"d":"0.0"},{"v":0,"d":"0.0"},{"v":0,"d":"0.0"},"HC","HC"]
[16,{"$f":"дети!A16","v":0},{"v":0,"d":"0.0"},{"v":0,"d":"0.0"},{"v":0,"d":"0.0"},{"v":0,"d":"0.0"},{"v":0,"d":"0.0"},{"v":0,"d":"0.0"},{"v":0,"d":"0.0"},{"v":0,"d":"0.0"},{"v":0,"d":"0.0"},{"v":0,"d":"0.0"},{"v":0,"d":"0.0"},{"v":0,"d":"0.0"},{"v":0,"d":"0.0"},{"v":0,"d":"0.0"},{"v":0,"d":"0.0"},{"v":0,"d":"0.0"},"HC","HC"]
[17,{"$f":"дети!A17","v":0},{"v":0,"d":"0.0"},{"v":0,"d":"0.0"},{"v":0,"d":"0.0"},{"v":0,"d":"0.0"},{"v":0,"d":"0.0"},{"v":0,"d":"0.0"},{"v":0,"d":"0.0"},{"v":0,"d":"0.0"},{"v":0,"d":"0.0"},{"v":0,"d":"0.0"},{"v":0,"d":"0.0"},{"v":0,"d":"0.0"},{"v":0,"d":"0.0"},{"v":0,"d":"0.0"},{"v":0,"d":"0.0"},{"v":0,"d":"0.0"},"HC","HC"]
[18,{"$f":"дети!A18","v":0},{"v":0,"d":"0.0"},{"v":0,"d":"0.0"},{"v":0,"d":"0.0"},{"v":0,"d":"0.0"},{"v":0,"d":"0.0"},{"v":0,"d":"0.0"},{"v":0,"d":"0.0"},{"v":0,"d":"0.0"},{"v":0,"d":"0.0"},{"v":0,"d":"0.0"},{"v":0,"d":"0.0"},{"v":0,"d":"0.0"},{"v":0,"d":"0.0"},{"v":0,"d":"0.0"},{"v":0,"d":"0.0"},{"v":0,"d":"0.0"},"HC","HC"]
[19,{"$f":"дети!A19","v":0},{"v":0,"d":"0.0"},{"v":0,"d":"0.0"},{"v":0,"d":"0.0"},{"v":0,"d":"0.0"},{"v":0,"d":"0.0"},{"v":0,"d":"0.0"},{"v":0,"d":"0.0"},{"v":0,"d":"0.0"},{"v":0,"d":"0.0"},{"v":0,"d":"0.0"},{"v":0,"d":"0.0"},{"v":0,"d":"0.0"},{"v":0,"d":"0.0"},{"v":0,"d":"0.0"},{"v":0,"d":"0.0"},{"v":0,"d":"0.0"},"HC","HC"]
[20,{"$f":"дети!A20","v":0},{"v":0,"d":"0.0"},{"v":0,"d":"0.0"},{"v":0,"d":"0.0"},{"v":0,"d":"0.0"},{"v":0,"d":"0.0"},{"v":0,"d":"0.0"},{"v":0,"d":"0.0"},{"v":0,"d":"0.0"},{"v":0,"d":"0.0"},{"v":0,"d":"0.0"},{"v":0,"d":"0.0"},{"v":0,"d":"0.0"},{"v":0,"d":"0.0"},{"v":0,"d":"0.0"},{"v":0,"d":"0.0"},{"v":0,"d":"0.0"},"HC","HC"]
[21,{"$f":"дети!A21","v":0},{"v":0,"d":"0.0"},{"v":0,"d":"0.0"},{"v":0,"d":"0.0"},{"v":0,"d":"0.0"},{"v":0,"d":"0.0"},{"v":0,"d":"0.0"},{"v":0,"d":"0.0"},{"v":0,"d":"0.0"},{"v":0,"d":"0.0"},{"v":0,"d":"0.0"},{"v":0,"d":"0.0"},{"v":0,"d":"0.0"},{"v":0,"d":"0.0"},{"v":0,"d":"0.0"},{"v":0,"d":"0.0"},{"v":0,"d":"0.0"},"HC","HC"]
[22,{"$f":"дети!A22","v":0},{"v":0,"d":"0.0"},{"v":0,"d":"0.0"},{"v":0,"d":"0.0"},{"v":0,"d":"0.0"},{"v":0,"d":"0.0"},{"v":0,"d":"0.0"},{"v":0,"d":"0.0"},{"v":0,"d":"0.0"},{"v":0,"d":"0.0"},{"v":0,"d":"0.0"},{"v":0,"d":"0.0"},{"v":0,"d":"0.0"},{"v":0,"d":"0.0"},{"v":0,"d":"0.0"},{"v":0,"d":"0.0"},{"v":0,"d":"0.0"},"HC","HC"]
[23,{"$f":"дети!A23","v":0},{"v":0,"d":"0.0"},{"v":0,"d":"0.0"},{"v":0,"d":"0.0"},{"v":0,"d":"0.0"},{"v":0,"d":"0.0"},{"v":0,"d":"0.0"},{"v":0,"d":"0.0"},{"v":0,"d":"0.0"},{"v":0,"d":"0.0"},{"v":0,"d":"0.0"},{"v":0,"d":"0.0"},{"v":0,"d":"0.0"},{"v":0,"d":"0.0"},{"v":0,"d":"0.0"},{"v":0,"d":"0.0"},{"v":0,"d":"0.0"},"HC","HC"]
[24,{"$f":"дети!A24","v":0},{"v":0,"d":"0.0"},{"v":0,"d":"0.0"},{"v":0,"d":"0.0"},{"v":0,"d":"0.0"},{"v":0,"d":"0.0"},{"v":0,"d":"0.0"},{"v":0,"d":"0.0"},{"v":0,"d":"0.0"},{"v":0,"d":"0.0"},{"v":0,"d":"0.0"},{"v":0,"d":"0.0"},{"v":0,"d":"0.0"},{"v":0,"d":"0.0"},{"v":0,"d":"0.0"},{"v":0,"d":"0.0"},{"v":0,"d":"0.0"},"HC","HC"]
[25,{"$f":"дети!A25","v":0},{"v":0,"d":"0.0"},{"v":0,"d":"0.0"},{"v":0,"d":"0.0"},{"v":0,"d":"0.0"},{"v":0,"d":"0.0"},{"v":0,"d":"0.0"},{"v":0,"d":"0.0"},{"v":0,"d":"0.0"},{"v":0,"d":"0.0"},{"v":0,"d":"0.0"},{"v":0,"d":"0.0"},{"v":0,"d":"0.0"},{"v":0,"d":"0.0"},{"v":0,"d":"0.0"},{"v":0,"d":"0.0"},{"v":0,"d":"0.0"},"HC","HC"]
[26,{"$f":"дети!A26","v":0},{"v":0,"d":"0.0"},{"v":0,"d":"0.0"},{"v":0,"d":"0.0"},{"v":0,"d":"0.0"},{"v":0,"d":"0.0"},{"v":0,"d":"0.0"},{"v":0,"d":"0.0"},{"v":0,"d":"0.0"},{"v":0,"d":"0.0"},{"v":0,"d":"0.0"},{"v":0,"d":"0.0"},{"v":0,"d":"0.0"},{"v":0,"d":"0.0"},{"v":0,"d":"0.0"},{"v":0,"d":"0.0"},{"v":0,"d":"0.0"},"HC","HC"]
[27,{"$f":"дети!A27","v":0},{"v":0,"d":"0.0"},{"v":0,"d":"0.0"},{"v":0,"d":"0.0"},{"v":0,"d":"0.0"},{"v":0,"d":"0.0"},{"v":0,"d":"0.0"},{"v":0,"d":"0.0"},{"v":0,"d":"0.0"},{"v":0,"d":"0.0"},{"v":0,"d":"0.0"},{"v":0,"d":"0.0"},{"v":0,"d":"0.0"},{"v":0,"d":"0.0"},{"v":0,"d":"0.0"},{"v":0,"d":"0.0"},{"v":0,"d":"0.0"},"HC","HC"]
[28,{"$f":"дети!A28","v":0},{"v":0,"d":"0.0"},{"v":0,"d":"0.0"},{"v":0,"d":"0.0"},{"v":0,"d":"0.0"},{"v":0,"d":"0.0"},{"v":0,"d":"0.0"},{"v":0,"d":"0.0"},{"v":0,"d":"0.0"},{"v":0,"d":"0.0"},{"v":0,"d":"0.0"},{"v":0,"d":"0.0"},{"v":0,"d":"0.0"},{"v":0,"d":"0.0"},{"v":0,"d":"0.0"},{"v":0,"d":"0.0"},{"v":0,"d":"0.0"},"HC","HC"]
["Итоговый показатель по группе (ср.значение)",null,{"$f":"SUM(C8:C35)/дети!G2","v":{"$error":"#DIV/0!"}}," ",{"$f":"SUM(E8:E35)/дети!G2","v":{"$error":"#DIV/0!"}},{"$f":"SUM(F8:F35)/дети!G2","v":{"$error":"#DIV/0!"}},{"$f":"SUM(G8:G35)/дети!G2","v":{"$error":"#DIV/0!"}},{"$f":"SUM(H8:H35)/дети!G2","v":{"$error":"#DIV/0!"}},{"$f":"SUM(I8:I35)/дети!G2","v":{"$error":"#DIV/0!"}},{"$f":"SUM(J8:J35)/дети!G2","v":{"$error":"#DIV/0!"}},{"$f":"SUM(K8:K35)/дети!G2","v":{"$error":"#DIV/0!"}},{"$f":"SUM(L8:L35)/дети!G2","v":{"$error":"#DIV/0!"}},{"$f":"SUM(M8:M35)/дети!G2","v":{"$error":"#DIV/0!"}},{"$f":"SUM(N8:N35)/дети!G2","v":{"$error":"#DIV/0!"}},{"$f":"SUM(O8:O35)/дети!G2","v":{"$error":"#DIV/0!"}},{"$f":"SUM(P8:P35)/дети!G2","v":{"$error":"#DIV/0!"}},{"$f":"SUM(Q8:Q35)/дети!G2","v":{"$error":"#DIV/0!"}},{"$f":"SUM(R8:R35)/дети!G2","v":{"$error":"#DIV/0!"}},{"$f":"SUM(S8:S33)/23","v":0},{"$f":"SUM(T8:T33)/23","v":0}]
[null,"\"3\" Сформирован (В)",{"$f":"COUNTIF(C8:C35,\"=3\")/дети!G2","v":{"$error":"#DIV/0!"}},{"$f":"COUNTIF(D8:D35,\"=3\")/дети!G2","v":{"$error":"#DIV/0!"}},{"$f":"COUNTIF(E8:E35,\"=3\")/дети!G2","v":{"$error":"#DIV/0!"}},{"$f":"COUNTIF(F8:F35,\"=3\")/дети!G2","v":{"$error":"#DIV/0!"}},{"$f":"COUNTIF(G8:G35,\"=3\")/дети!G2","v":{"$error":"#DIV/0!"}},{"$f":"COUNTIF(H8:H35,\"=3\")/дети!G2","v":{"$error":"#DIV/0!"}},{"$f":"COUNTIF(I8:I35,\"=3\")/дети!G2","v":{"$error":"#DIV/0!"}},{"$f":"COUNTIF(J8:J35,\"=3\")/дети!G2","v":{"$error":"#DIV/0!"}},{"$f":"COUNTIF(K8:K35,\"=3\")/дети!G2","v":{"$error":"#DIV/0!"}},{"$f":"COUNTIF(L8:L35,\"=3\")/дети!G2","v":{"$error":"#DIV/0!"}},{"$f":"COUNTIF(M8:M35,\"=3\")/дети!G2","v":{"$error":"#DIV/0!"}},{"$f":"COUNTIF(N8:N35,\"=3\")/дети!G2","v":{"$error":"#DIV/0!"}},{"$f":"COUNTIF(O8:O35,\"=3\")/дети!G2","v":{"$error":"#DIV/0!"}},{"$f":"COUNTIF(P8:P35,\"=3\")/дети!G2","v":{"$error":"#DIV/0!"}},{"$f":"COUNTIF(Q8:Q35,\"=3\")/дети!G2","v":{"$error":"#DIV/0!"}},{"$f":"COUNTIF(R8:R35,\"=3\")/дети!G2","v":{"$error":"#DIV/0!"}}]
[null,"\"2\" Находится в стадии формирования (С)",{"$f":"COUNTIF(C8:C35,\"=2\")/дети!G2","v":{"$error":"#DIV/0!"}},{"$f":"COUNTIF(D8:D35,\"=2\")/дети!G2","v":{"$error":"#DIV/0!"}},{"$f":"COUNTIF(E8:E35,\"=2\")/дети!G2","v":{"$error":"#DIV/0!"}},{"$f":"COUNTIF(F8:F35,\"=2\")/дети!G2","v":{"$error":"#DIV/0!"}},{"$f":"COUNTIF(G8:G35,\"=2\")/дети!G2","v":{"$error":"#DIV/0!"}},{"$f":"COUNTIF(H8:H35,\"=2\")/дети!G2","v":{"$error":"#DIV/0!"}},{"$f":"COUNTIF(I8:I35,\"=2\")/дети!G2","v":{"$error":"#DIV/0!"}},{"$f":"COUNTIF(J8:J35,\"=2\")/дети!G2","v":{"$error":"#DIV/0!"}},{"$f":"COUNTIF(K8:K35,\"=2\")/дети!G2","v":{"$error":"#DIV/0!"}},{"$f":"COUNTIF(L8:L35,\"=2\")/дети!G2","v":{"$error":"#DIV/0!"}},{"$f":"COUNTIF(M8:M35,\"=2\")/дети!G2","v":{"$error":"#DIV/0!"}},{"$f":"COUNTIF(N8:N35,\"=2\")/дети!G2","v":{"$error":"#DIV/0!"}},{"$f":"COUNTIF(O8:O35,\"=2\")/дети!G2","v":{"$error":"#DIV/0!"}},{"$f":"COUNTIF(P8:P35,\"=2\")/дети!G2","v":{"$error":"#DIV/0!"}},{"$f":"100%-(Q39+Q37)","v":{"$error":"#DIV/0!"}},{"$f":"100%-(R39+R37)","v":{"$error":"#DIV/0!"}}]
[null,"\"1\" Не сформирован (НС)",{"$f":"COUNTIF(C8:C35,\"=1\")/дети!G2","v":{"$error":"#DIV/0!"}},{"$f":"COUNTIF(D8:D35,\"=1\")/дети!G2","v":{"$error":"#DIV/0!"}},{"$f":"COUNTIF(E8:E35,\"=1\")/дети!G2","v":{"$error":"#DIV/0!"}},{"$f":"COUNTIF(F8:F35,\"=1\")/дети!G2","v":{"$error":"#DIV/0!"}},{"$f":"COUNTIF(G8:G35,\"=1\")/дети!G2","v":{"$error":"#DIV/0!"}},{"$f":"COUNTIF(H8:H35,\"=1\")/дети!G2","v":{"$error":"#DIV/0!"}},{"$f":"COUNTIF(I8:I35,\"=1\")/дети!G2","v":{"$error":"#DIV/0!"}},{"$f":"COUNTIF(J8:J35,\"=1\")/дети!G2","v":{"$error":"#DIV/0!"}},{"$f":"COUNTIF(K8:K35,\"=1\")/дети!G2","v":{"$error":"#DIV/0!"}},{"$f":"COUNTIF(L8:L35,\"=1\")/дети!G2","v":{"$error":"#DIV/0!"}},{"$f":"COUNTIF(M8:M35,\"=1\")/дети!G2","v":{"$error":"#DIV/0!"}},{"$f":"COUNTIF(N8:N35,\"=1\")/дети!G2","v":{"$error":"#DIV/0!"}},{"$f":"COUNTIF(O8:O35,\"=1\")/дети!G2","v":{"$error":"#DIV/0!"}},{"$f":"COUNTIF(P8:P35,\"=1\")/дети!G2","v":{"$error":"#DIV/0!"}},{"$f":"COUNTIF(Q8:Q35,\"<2\")/дети!G2","v":{"$error":"#DIV/0!"}},{"$f":"COUNTIF(R8:R35,\"<2\")/дети!G2","v":{"$error":"#DIV/0!"}}]

{"sheet":"познават","index":3,"n_rows":43,"n_cols":22,"rows_kept":43,"merged":[[4,0,5,0],[4,1,5,1],[4,2,4,3],[4,4,4,5],[4,6,4,7],[4,8,4,9],[4,10,4,11],[4,12,4,13],[4,14,4,15],[4,18,4,19],[34,0,34,1]]}
[null,{"$f":"дети!A38","v":"Мониторинг образовательного процесса группы № __  (младшая) на 20__-20__ уч.г."}]
[{"$f":"дети!A39","v":"Воспитатель: _____________________________"}]
[{"$f":"дети!A40","v":"Воспитатель: ________________________________"}]
[null,"Мониторинг знаний 3-4 л.  по образовательной области «Познавательное развитие»"]
["№п/п","Фамилия, имя ребенка","Знает   свои    имя и фамилию, имена родителей",null,"Рассматривает иллюстрированные     издания детских книг, проявляет интерес к ним",null,"Ориентируется в помещениях детского сада, называет свой город",null,"Знает и называет некоторые  растения и животных, их детенышей, игрушки",null,"Правильно определяет количественное  соотношение двух групп предметов, понимает конкретный   смысл слов «больше, «меньше», «столько же»",null,"Различает круг, квадрат, треугольник,   предметы,  имеющие углы  и круглую форму. Умеет  группировать предметы по цвету, размеру, форме",null,"Понимает   смысл обозначений: вверху - внизу, впереди-сзади, слева-справа, на,   над-под, верхняя — нижняя. Различает день —ночь, зима-лето",null,"Итоговый показатель по каждому ребенку (ср.значение)",null,"Уровень"]
[null,null,"н.г.","к.г.","н.г.","к.г.","н.г.","к.г.","н.г.","к.г.","н.г.","к.г.","н.г.","к.г.","н.г.","к.г.","н.г.","к.г.","н.г.","к.г."]
[1,{"$f":"дети!A1","v":0},{"v":0,"d":"0.0"},{"v":0,"d":"0.0"},{"v":0,"d":"0.0"},{"v":0,"d":"0.0"},{"v":0,"d":"0.0"},{"v":0,"d":"0.0"},{"v":0,"d":"0.0"},{"v":0,"d":"0.0"},{"v":0,"d":"0.0"},{"v":0,"d":"0.0"},{"v":0,"d":"0.0"},{"v":0,"d":"0.0"},{"v":0,"d":"0.0"},{"v":0,"d":"0.0"},{"$f":"(C7+E7+G7+I7+K7+M7+O7)/7","v":{"v":0,"d":"0.0"}},{"$f":"(D7+F7+H7+J7+L7+N7+P7)/7","v":{"v":0,"d":"0.0"}},{"$f":"IF(Q7=3,\"B\",IF(Q7>=2,\"C\",\"HC\"))","v":"HC"},{"$f":"IF(R7=3,\"B\",IF(R7>=2,\"C\",\"HC\"))","v":"HC"}]
[2,{"$f":"дети!A2","v":0},{"v":0,"d":"0.0"},{"v":0,"d":"0.0"},{"v":0,"d":"0.0"},{"v":0,"d":"0.0"},{"v":0,"d":"0.0"},{"v":0,"d":"0.0"},{"v":0,"d":"0.0"},{"v":0,"d":"0.0"},{"v":0,"d":"0.0"},{"v":0,"d":"0.0"},{"v":0,"d":"0.0"},{"v":0,"d":"0.0"},{"v":0,"d":"0.0"},{"v":0,"d":"0.0"},{"$f":"(C8+E8+G8+I8+K8+M8+O8)/7","v":{"v":0,"d":"0.0"}},{"$f":"(D8+F8+H8+J8+L8+N8+P8)/7","v":{"v":0,"d":"0.0"}},{"$f":"IF(Q8=3,\"B\",IF(Q8>=2,\"C\",\"HC\"))","v":"HC"},{"$f":"IF(R8=3,\"B\",IF(R8>=2,\"C\",\"HC\"))","v":"HC"}]
[3,{"$f":"дети!A3","v":0},{"v":0,"d":"0.0"},{"v":0,"d":"0.0"},{"v":0,"d":"0.0"},{"v":0,"d":"0.0"},{"v":0,"d":"0.0"},{"v":0,"d":"0.0"},{"v":0,"d":"0.0"},{"v":0,"d":"0.0"},{"v":0,"d":"0.0"},{"v":0,"d":"0.0"},{"v":0,"d":"0.0"},{"v":0,"d":"0.0"},{"v":0,"d":"0.0"},{"v":0,"d":"0.0"},{"v":0,"d":"0.0"},{"v":0,"d":"0.0"},"HC","HC"]
[4,{"$f":"дети!A4","v":0},{"v":0,"d":"0.0"},{"v":0,"d":"0.0"},{"v":0,"d":"0.0"},{"v":0,"d":"0.0"},{"v":0,"d":"0.0"},{"v":0,"d":"0.0"},{"v":0,"d":"0.0"},{"v":0,"d":"0.0"},{"v":0,"d":"0.0"},{"v":0,"d":"0.0"},{"v":0,"d":"0.0"},{"v":0,"d":"0.0"},{"v":0,"d":"0.0"},{"v":0,"d":"0.0"},{"v":0,"d":"0.0"},{"v":0,"d":"0.0"},"HC","HC"]
[5,{"$f":"дети!A5","v":0},{"v":0,"d":"0.0"},{"v":0,"d":"0.0"},{"v":0,"d":"0.0"},{"v":0,"d":"0.0"},{"v":0,"d":"0.0"},{"v":0,"d":"0.0"},{"v":0,"d":"0.0"},{"v":0,"d":"0.0"},{"v":0,"d":"0.0"},{"v":0,"d":"0.0"},{"v":0,"d":"0.0"},{"v":0,"d":"0.0"},{"v":0,"d":"0.0"},{"v":0,"d":"0.0"},{"v":0,"d":"0.0"},{"v":0,"d":"0.0"},"HC","HC"]
[6,{"$f":"дети!A6","v":0},{"v":0,"d":"0.0"},{"v":0,"d":"0.0"},{"v":0,"d":"0.0"},{"v":0,"d":"0.0"},{"v":0,"d":"0.0"},{"v":0,"d":"0.0"},{"v":0,"d":"0.0"},{"v":0,"d":"0.0"},{"v":0,"d":"0.0"},{"v":0,"d":"0.0"},{"v":0,"d":"0.0"},{"v":0,"d":"0.0"},{"v":0,"d":"0.0"},{"v":0,"d":"0.0"},{"v":0,"d":"0.0"},{"v":0,"d":"0.0"},"HC","HC"]
[7,{"$f":"дети!A7","v":0},{"v":0,"d":"0.0"},{"v":0,"d":"0.0"},{"v":0,"d":"0.0"},{"v":0,"d":"0.0"},{"v":0,"d":"0.0"},{"v":0,"d":"0.0"},{"v":0,"d":"0.0"},{"v":0,"d":"0.0"},{"v":0,"d":"0.0"},{"v":0,"d":"0.0"},{"v":0,"d":"0.0"},{"v":0,"d":"0.0"},{"v":0,"d":"0.0"},{"v":0,"d":"0.0"},{"v":0,"d":"0.0"},{"v":0,"d":"0.0"},"HC","HC"]
[8,{"$f":"дети!A8","v":0},{"v":0,"d":"0.0"},{"v":0,"d":"0.0"},{"v":0,"d":"0.0"},{"v":0,"d":"0.0"},{"v":0,"d":"0.0"},{"v":0,"d":"0.0"},{"v":0,"d":"0.0"},{"v":0,"d":"0.0"},{"v":0,"d":"0.0"},{"v":0,"d":"0.0"},{"v":0,"d":"0.0"},{"v":0,"d":"0.0"},{"v":0,"d":"0.0"},{"v":0,"d":"0.0"},{"v":0,"d":"0.0"},{"v":0,"d":"0.0"},"HC","HC"]
[9,{"$f":"дети!A9","v":0},{"v":0,"d":"0.0"},{"v":0,"d":"0.0"},{"v":0,"d":"0.0"},{"v":0,"d":"0.0"},{"v":0,"d":"0.0"},{"v":0,"d":"0.0"},{"v":0,"d":"0.0"},{"v":0,"d":"0.0"},{"v":0,"d":"0.0"},{"v":0,"d":"0.0"},{"v":0,"d":"0.0"},{"v":0,"d":"0.0"},{"v":0,"d":"0.0"},{"v":0,"d":"0.0"},{"v":0,"d":"0.0"},{"v":0,"d":"0.0"},"HC","HC"]
[10,{"$f":"дети!A10","v":0},{"v":0,"d":"0.0"},{"v":0,"d":"0.0"},{"v":0,"d":"0.0"},{"v":0,"d":"0.0"},{"v":0,"d":"0.0"},{"v":0,"d":"0.0"},{"v":0,"d":"0.0"},{"v":0,"d":"0.0"},{"v":0,"d":"0.0"},{"v":0,"d":"0.0"},{"v":0,"d":"0.0"},{"v":0,"d":"0.0"},{"v":0,"d":"0.0"},{"v":0,"d":"0.0"},{"v":0,"d":"0.0"},{"v":0,"d":"0.0"},"HC","HC"]
[11,{"$f":"дети!A11","v":0},{"v":0,"d":"0.0"},{"v":0,"d":"0.0"},{"v":0,"d":"0.0"},{"v":0,"d":"0.0"},{"v":0,"d":"0.0"},{"v":0,"d":"0.0"},{"v":0,"d":"0.0"},{"v":0,"d":"0.0"},{"v":0,"d":"0.0"},{"v":0,"d":"0.0"},{"v":0,"d":"0.0"},{"v":0,"d":"0.0"},{"v":0,"d":"0.0"},{"v":0,"d":"0.0"},{"v":0,"d":"0.0"},{"v":0,"d":"0.0"},"HC","HC"]
[12,{"$f":"дети!A12","v":0},{"v":0,"d":"0.0"},{"v":0,"d":"0.0"},{"v":0,"d":"0.0"},{"v":0,"d":"0.0"},{"v":0,"d":"0.0"},{"v":0,"d":"0.0"},{"v":0,"d":"0.0"},{"v":0,"d":"0.0"},{"v":0,"d":"0.0"},{"v":0,"d":"0.0"},{"v":0,"d":"0.0"},{"v":0,"d":"0.0"},{"v":0,"d":"0.0"},{"v":0,"d":"0.0"},{"v":0,"d":"0.0"},{"v":0,"d":"0.0"},"HC","HC"]
[13,{"$f":"дети!A13","v":0},{"v":0,"d":"0.0"},{"v":0,"d":"0.0"},{"v":0,"d":"0.0"},{"v":0,"d":"0.0"},{"v":0,"d":"0.0"},{"v":0,"d":"0.0"},{"v":0,"d":"0.0"},{"v":0,"d":"0.0"},{"v":0,"d":"0.0"},{"v":0,"d":"0.0"},{"v":0,"d":"0.0"},{"v":0,"d":"0.0"},{"v":0,"d":"0.0"},{"v":0,"d":"0.0"},{"v":0,"d":"0.0"},{"v":0,"d":"0.0"},"HC","HC"]
[14,{"$f":"дети!A14","v":0},{"v":0,"d":"0.0"},{"v":0,"d":"0.0"},{"v":0,"d":"0.0"},{"v":0,"d":"0.0"},{"v":0,"d":"0.0"},{"v":0,"d":"0.0"},{"v":0,"d":"0.0"},{"v":0,"d":"0.0"},{"v":0,"d":"0.0"},{"v":0,"d":"0.0"},{"v":0,"d":"0.0"},{"v":0,"d":"0.0"},{"v":0,"d":"0.0"},{"v":0,"d":"0.0"},{"v":0,"d":"0.0"},{"v":0,"d":"0.0"},"HC","HC"]
[15,{"$f":"дети!A15","v":0},{"v":0,"d":"0.0"},{"v":0,"d":"0.0"},{"v":0,"d":"0.0"},{"v":0,"d":"0.0"},{"v":0,"d":"0.0"},{"v":0,"d":"0.0"},{"v":0,"d":"0.0"},{"v":0,"d":"0.0"},{"v":0,"d":"0.0"},{"v":0,"d":"0.0"},{"v":0,"d":"0.0"},{"v":0,"d":"0.0"},{"v":0,"d":"0.0"},{"v":0,"d":"0.0"},{"v":0,"d":"0.0"},{"v":0,"d":"0.0"},"HC","HC"]
[16,{"$f":"дети!A16","v":0},{"v":0,"d":"0.0"},{"v":0,"d":"0.0"},{"v":0,"d":"0.0"},{"v":0,"d":"0.0"},{"v":0,"d":"0.0"},{"v":0,"d":"0.0"},{"v":0,"d":"0.0"},{"v":0,"d":"0.0"},{"v":0,"d":"0.0"},{"v":0,"d":"0.0"},{"v":0,"d":"0.0"},{"v":0,"d":"0.0"},{"v":0,"d":"0.0"},{"v":0,"d":"0.0"},{"v":0,"d":"0.0"},{"v":0,"d":"0.0"},"HC","HC"]
[17,{"$f":"дети!A17","v":0},{"v":0,"d":"0.0"},{"v":0,"d":"0.0"},{"v":0,"d":"0.0"},{"v":0,"d":"0.0"},{"v":0,"d":"0.0"},{"v":0,"d":"0.0"},{"v":0,"d":"0.0"},{"v":0,"d":"0.0"},{"v":0,"d":"0.0"},{"v":0,"d":"0.0"},{"v":0,"d":"0.0"},{"v":0,"d":"0.0"},{"v":0,"d":"0.0"},{"v":0,"d":"0.0"},{"v":0,"d":"0.0"},{"v":0,"d":"0.0"},"HC","HC"]
[18,{"$f":"дети!A18","v":0},{"v":0,"d":"0.0"},{"v":0,"d":"0.0"},{"v":0,"d":"0.0"},{"v":0,"d":"0.0"},{"v":0,"d":"0.0"},{"v":0,"d":"0.0"},{"v":0,"d":"0.0"},{"v":0,"d":"0.0"},{"v":0,"d":"0.0"},{"v":0,"d":"0.0"},{"v":0,"d":"0.0"},{"v":0,"d":"0.0"},{"v":0,"d":"0.0"},{"v":0,"d":"0.0"},{"v":0,"d":"0.0"},{"v":0,"d":"0.0"},"HC","HC"]
[19,{"$f":"дети!A19","v":0},{"v":0,"d":"0.0"},{"v":0,"d":"0.0"},{"v":0,"d":"0.0"},{"v":0,"d":"0.0"},{"v":0,"d":"0.0"},{"v":0,"d":"0.0"},{"v":0,"d":"0.0"},{"v":0,"d":"0.0"},{"v":0,"d":"0.0"},{"v":0,"d":"0.0"},{"v":0,"d":"0.0"},{"v":0,"d":"0.0"},{"v":0,"d":"0.0"},{"v":0,"d":"0.0"},{"v":0,"d":"0.0"},{"v":0,"d":"0.0"},"HC","HC"]
[20,{"$f":"дети!A20","v":0},{"v":0,"d":"0.0"},{"v":0,"d":"0.0"},{"v":0,"d":"0.0"},{"v":0,"d":"0.0"},{"v":0,"d":"0.0"},{"v":0,"d":"0.0"},{"v":0,"d":"0.0"},{"v":0,"d":"0.0"},{"v":0,"d":"0.0"},{"v":0,"d":"0.0"},{"v":0,"d":"0.0"},{"v":0,"d":"0.0"},{"v":0,"d":"0.0"},{"v":0,"d":"0.0"},{"v":0,"d":"0.0"},{"v":0,"d":"0.0"},"HC","HC"]
[21,{"$f":"дети!A21","v":0},{"v":0,"d":"0.0"},{"v":0,"d":"0.0"},{"v":0,"d":"0.0"},{"v":0,"d":"0.0"},{"v":0,"d":"0.0"},{"v":0,"d":"0.0"},{"v":0,"d":"0.0"},{"v":0,"d":"0.0"},{"v":0,"d":"0.0"},{"v":0,"d":"0.0"},{"v":0,"d":"0.0"},{"v":0,"d":"0.0"},{"v":0,"d":"0.0"},{"v":0,"d":"0.0"},{"v":0,"d":"0.0"},{"v":0,"d":"0.0"},"HC","HC"]
[22,{"$f":"дети!A22","v":0},{"v":0,"d":"0.0"},{"v":0,"d":"0.0"},{"v":0,"d":"0.0"},{"v":0,"d":"0.0"},{"v":0,"d":"0.0"},{"v":0,"d":"0.0"},{"v":0,"d":"0.0"},{"v":0,"d":"0.0"},{"v":0,"d":"0.0"},{"v":0,"d":"0.0"},{"v":0,"d":"0.0"},{"v":0,"d":"0.0"},{"v":0,"d":"0.0"},{"v":0,"d":"0.0"},{"v":0,"d":"0.0"},{"v":0,"d":"0.0"},"HC","HC"]
[23,{"$f":"дети!A23","v":0},{"v":0,"d":"0.0"},{"v":0,"d":"0.0"},{"v":0,"d":"0.0"},{"v":0,"d":"0.0"},{"v":0,"d":"0.0"},{"v":0,"d":"0.0"},{"v":0,"d":"0.0"},{"v":0,"d":"0.0"},{"v":0,"d":"0.0"},{"v":0,"d":"0.0"},{"v":0,"d":"0.0"},{"v":0,"d":"0.0"},{"v":0,"d":"0.0"},{"v":0,"d":"0.0"},{"v":0,"d":"0.0"},{"v":0,"d":"0.0"},"HC","HC"]
[24,{"$f":"дети!A24","v":0},{"v":0,"d":"0.0"},{"v":0,"d":"0.0"},{"v":0,"d":"0.0"},{"v":0,"d":"0.0"},{"v":0,"d":"0.0"},{"v":0,"d":"0.0"},{"v":0,"d":"0.0"},{"v":0,"d":"0.0"},{"v":0,"d":"0.0"},{"v":0,"d":"0.0"},{"v":0,"d":"0.0"},{"v":0,"d":"0.0"},{"v":0,"d":"0.0"},{"v":0,"d":"0.0"},{"v":0,"d":"0.0"},{"v":0,"d":"0.0"},"HC","HC"]
[25,{"$f":"дети!A25","v":0},{"v":0,"d":"0.0"},{"v":0,"d":"0.0"},{"v":0,"d":"0.0"},{"v":0,"d":"0.0"},{"v":0,"d":"0.0"},{"v":0,"d":"0.0"},{"v":0,"d":"0.0"},{"v":0,"d":"0.0"},{"v":0,"d":"0.0"},{"v":0,"d":"0.0"},{"v":0,"d":"0.0"},{"v":0,"d":"0.0"},{"v":0,"d":"0.0"},{"v":0,"d":"0.0"},{"v":0,"d":"0.0"},{"v":0,"d":"0.0"},"HC","HC"]
[26,{"$f":"дети!A26","v":0},{"v":0,"d":"0.0"},{"v":0,"d":"0.0"},{"v":0,"d":"0.0"},{"v":0,"d":"0.0"},{"v":0,"d":"0.0"},{"v":0,"d":"0.0"},{"v":0,"d":"0.0"},{"v":0,"d":"0.0"},{"v":0,"d":"0.0"},{"v":0,"d":"0.0"},{"v":0,"d":"0.0"},{"v":0,"d":"0.0"},{"v":0,"d":"0.0"},{"v":0,"d":"0.0"},{"v":0,"d":"0.0"},{"v":0,"d":"0.0"},"HC","HC"]
[27,{"$f":"дети!A27","v":0},{"v":0,"d":"0.0"},{"v":0,"d":"0.0"},{"v":0,"d":"0.0"},{"v":0,"d":"0.0"},{"v":0,"d":"0.0"},{"v":0,"d":"0.0"},{"v":0,"d":"0.0"},{"v":0,"d":"0.0"},{"v":0,"d":"0.0"},{"v":0,"d":"0.0"},{"v":0,"d":"0.0"},{"v":0,"d":"0.0"},{"v":0,"d":"0.0"},{"v":0,"d":"0.0"},{"v":0,"d":"0.0"},{"v":0,"d":"0.0"},"HC","HC"]
[28,{"$f":"дети!A28","v":0},{"v":0,"d":"0.0"},{"v":0,"d":"0.0"},{"v":0,"d":"0.0"},{"v":0,"d":"0.0"},{"v":0,"d":"0.0"},{"v":0,"d":"0.0"},{"v":0,"d":"0.0"},{"v":0,"d":"0.0"},{"v":0,"d":"0.0"},{"v":0,"d":"0.0"},{"v":0,"d":"0.0"},{"v":0,"d":"0.0"},{"v":0,"d":"0.0"},{"v":0,"d":"0.0"},{"v":0,"d":"0.0"},{"v":0,"d":"0.0"},"HC","HC"]
["Итоговый пок-ль по группе (ср. значение)",null,{"$f":"SUM(C7:C34)/дети!G2","v":{"$error":"#DIV/0!"}},{"$f":"SUM(D7:D34)/дети!G2","v":{"$error":"#DIV/0!"}},{"$f":"SUM(E7:E34)/дети!G2","v":{"$error":"#DIV/0!"}},{"$f":"SUM(F7:F34)/дети!G2","v":{"$error":"#DIV/0!"}},{"$f":"SUM(G7:G34)/дети!G2","v":{"$error":"#DIV/0!"}},{"$f":"SUM(H7:H32)/23","v":{"v":0,"d":"0.0"}},{"$f":"SUM(I7:I34)/дети!G2","v":{"$error":"#DIV/0!"}},{"$f":"SUM(J7:J34)/дети!G2","v":{"$error":"#DIV/0!"}},{"$f":"SUM(K7:K34)/дети!G2","v":{"$error":"#DIV/0!"}},{"$f":"SUM(L7:L34)/дети!G2","v":{"$error":"#DIV/0!"}},{"$f":"SUM(M7:M34)/дети!G2","v":{"$error":"#DIV/0!"}},{"$f":"SUM(N7:N34)/дети!G2","v":{"$error":"#DIV/0!"}},{"$f":"SUM(O7:O34)/дети!G2","v":{"$error":"#DIV/0!"}},{"$f":"SUM(P7:P34)/дети!G2","v":{"$error":"#DIV/0!"}},{"$f":"SUM(Q7:Q34)/дети!G2","v":{"$error":"#DIV/0!"}},{"$f":"SUM(R7:R34)/дети!G2","v":{"$error":"#DIV/0!"}},{"$f":"SUM(S7:S32)/23","v":0},{"$f":"SUM(T7:T32)/23","v":0}]
[null,"\"3\" Сформирован (В)",{"$f":"COUNTIF(C7:C34,\"=3\")/дети!G2","v":{"$error":"#DIV/0!"}},{"$f":"COUNTIF(D7:D34,\"=3\")/дети!G2","v":{"$error":"#DIV/0!"}},{"$f":"COUNTIF(E7:E34,\"=3\")/дети!G2","v":{"$error":"#DIV/0!"}},{"$f":"COUNTIF(F7:F34,\"=3\")/дети!G2","v":{"$error":"#DIV/0!"}},{"$f":"COUNTIF(G7:G34,\"=3\")/дети!G2","v":{"$error":"#DIV/0!"}},{"$f":"COUNTIF(H7:H34,\"=3\")/дети!G2","v":{"$error":"#DIV/0!"}},{"$f":"COUNTIF(I7:I34,\"=3\")/дети!G2","v":{"$error":"#DIV/0!"}},{"$f":"COUNTIF(J7:J34,\"=3\")/дети!G2","v":{"$error":"#DIV/0!"}},{"$f":"COUNTIF(K7:K34,\"=3\")/дети!G2","v":{"$error":"#DIV/0!"}},{"$f":"COUNTIF(L7:L34,\"=3\")/дети!G2","v":{"$error":"#DIV/0!"}},{"$f":"COUNTIF(M7:M34,\"=3\")/дети!G2","v":{"$error":"#DIV/0!"}},{"$f":"COUNTIF(N7:N34,\"=3\")/дети!G2","v":{"$error":"#DIV/0!"}},{"$f":"COUNTIF(O7:O34,\"=3\")/дети!G2","v":{"$error":"#DIV/0!"}},{"$f":"COUNTIF(P7:P34,\"=3\")/дети!G2","v":{"$error":"#DIV/0!"}},{"$f":"COUNTIF(Q7:Q34,\"=3\")/дети!G2","v":{"$error":"#DIV/0!"}},{"$f":"COUNTIF(R7:R34,\"=3\")/дети!G2","v":{"$error":"#DIV/0!"}}]
[null,"\"2\" Находится в стадии формирования (С)",{"$f":"COUNTIF(C7:C34,\"=2\")/дети!G2","v":{"$error":"#DIV/0!"}},{"$f":"COUNTIF(D7:D34,\"=2\")/дети!G2","v":{"$error":"#DIV/0!"}},{"$f":"COUNTIF(E7:E34,\"=2\")/дети!G2","v":{"$error":"#DIV/0!"}},{"$f":"COUNTIF(F7:F34,\"=2\")/дети!G2","v":{"$error":"#DIV/0!"}},{"$f":"COUNTIF(G7:G34,\"=2\")/дети!G2","v":{"$error":"#DIV/0!"}},{"$f":"COUNTIF(H7:H34,\"=2\")/дети!G2","v":{"$error":"#DIV/0!"}},{"$f":"COUNTIF(I7:I34,\"=2\")/дети!G2","v":{"$error":"#DIV/0!"}},{"$f":"COUNTIF(J7:J34,\"=2\")/дети!G2","v":{"$error":"#DIV/0!"}},{"$f":"COUNTIF(K7:K34,\"=2\")/дети!G2","v":{"$error":"#DIV/0!"}},{"$f":"COUNTIF(L7:L34,\"=2\")/дети!G2","v":{"$error":"#DIV/0!"}},{"$f":"COUNTIF(M7:M34,\"=2\")/дети!G2","v":{"$error":"#DIV/0!"}},{"$f":"COUNTIF(N7:N34,\"=2\")/дети!G2","v":{"$error":"#DIV/0!"}},{"$f":"COUNTIF(O7:O34,\"=2\")/дети!G2","v":{"$error":"#DIV/0!"}},{"$f":"COUNTIF(P7:P34,\"=2\")/дети!G2","v":{"$error":"#DIV/0!"}},{"$f":"100%-(Q38+Q36)","v":{"$error":"#DIV/0!"}},{"$f":"100%-(R38+R36)","v":{"$error":"#DIV/0!"}}]
[null,"\"1\" Не сформирован (НС)",{"$f":"COUNTIF(C7:C34,\"=1\")/дети!G2","v":{"$error":"#DIV/0!"}},{"$f":"COUNTIF(D7:D34,\"=1\")/дети!G2","v":{"$error":"#DIV/0!"}},{"$f":"COUNTIF(E7:E34,\"=1\")/дети!G2","v":{"$error":"#DIV/0!"}},{"$f":"COUNTIF(F7:F34,\"=1\")/дети!G2","v":{"$error":"#DIV/0!"}},{"$f":"COUNTIF(G7:G34,\"=1\")/дети!G2","v":{"$error":"#DIV/0!"}},{"$f":"COUNTIF(H7:H34,\"=1\")/дети!G2","v":{"$error":"#DIV/0!"}},{"$f":"COUNTIF(I7:I34,\"=1\")/дети!G2","v":{"$error":"#DIV/0!"}},{"$f":"COUNTIF(J7:J34,\"=1\")/дети!G2","v":{"$error":"#DIV/0!"}},{"$f":"COUNTIF(K7:K34,\"=1\")/дети!G2","v":{"$error":"#DIV/0!"}},{"$f":"COUNTIF(L7:L34,\"=1\")/дети!G2","v":{"$error":"#DIV/0!"}},{"$f":"COUNTIF(M7:M34,\"=1\")/дети!G2","v":{"$error":"#DIV/0!"}},{"$f":"COUNTIF(N7:N34,\"=1\")/дети!G2","v":{"$error":"#DIV/0!"}},{"$f":"COUNTIF(O7:O34,\"=1\")/дети!G2","v":{"$error":"#DIV/0!"}},{"$f":"COUNTIF(P7:P34,\"=1\")/дети!G2","v":{"$error":"#DIV/0!"}},{"$f":"COUNTIF(Q7:Q34,\"<2\")/дети!G2","v":{"$error":"#DIV/0!"}},{"$f":"COUNTIF(R7:R34,\"<2\")/дети!G2","v":{"$error":"#DIV/0!"}}]
[]
[]
[]
[]
[{"$nulls":21},"разделить на число детей 29"]

{"sheet":"речевое","index":4,"n_rows":38,"n_cols":18,"rows_kept":38,"merged":[[4,0,5,0],[4,1,5,1],[4,2,4,3],[4,4,4,5],[4,6,4,7],[4,8,4,9],[4,10,4,11],[4,12,4,13],[4,14,4,15],[4,16,4,17],[34,0,34,1]]}
[null,{"$f":"дети!A38","v":"Мониторинг образовательного процесса группы № __  (младшая) на 20__-20__ уч.г."}]
[{"$f":"дети!A39","v":"Воспитатель: _____________________________"}]
[{"$f":"дети!A40","v":"Воспитатель: ________________________________"}]
[null,null,"Мониторинг знаний 3-4 л.  по образовательной области «Речевое развитие» "]
["№ п/п","Фамилия, имя ребенка","Рассматривает сюжетные картинки, способен кратко рассказать об увиденном",null,"Отвечает на вопросы взрослого, касающиеся ближайшего окружения",null,"Использует все части речи, простые нераспространенные предложения и предложения с однородными членами",null,"Четко произносит все гласные звуки,  определяет заданный   гласный   звук   из двух",null,"Называет произведение (в произвольном изложении), прослушав отрывок из него.",null,"Может прочитать наизусть небольшое стихотворение при помощи взрослого",null,"Итоговый показатель по каждому ребенку (ср. значение)",null,"Уровень"]
[null,null,"н.г.","к.г.","н.г.","к.г.","н.г.","к.г.","н.г.","к.г.","н.г.","к.г.","н.г.","к.г.","н.г.","к.г.","н.г.","к.г."]
[1,{"$f":"дети!A1","v":0},{"v":0,"d":"0.0"},{"v":0,"d":"0.0"},{"v":0,"d":"0.0"},{"v":0,"d":"0.0"},{"v":0,"d":"0.0"},{"v":0,"d":"0.0"},{"v":0,"d":"0.0"},{"v":0,"d":"0.0"},{"v":0,"d":"0.0"},{"v":0,"d":"0.0"},{"v":0,"d":"0.0"},{"v":0,"d":"0.0"},{"$f":"(C7+E7+G7+I7+K7+M7)/6","v":{"v":0,"d":"0.0"}},{"$f":"(D7+F7+H7+J7+L7+N7)/6","v":{"v":0,"d":"0.0"}},{"$f":"IF(O7=3,\"B\",IF(O7>=2,\"C\",\"HC\"))","v":"HC"},{"$f":"IF(P7=3,\"B\",IF(P7>=2,\"C\",\"HC\"))","v":"HC"}]
[2,{"$f":"дети!A2","v":0},{"v":0,"d":"0.0"},{"v":0,"d":"0.0"},{"v":0,"d":"0.0"},{"v":0,"d":"0.0"},{"v":0,"d":"0.0"},{"v":0,"d":"0.0"},{"v":0,"d":"0.0"},{"v":0,"d":"0.0"},{"v":0,"d":"0.0"},{"v":0,"d":"0.0"},{"v":0,"d":"0.0"},{"v":0,"d":"0.0"},{"$f":"(C8+E8+G8+I8+K8+M8)/6","v":{"v":0,"d":"0.0"}},{"$f":"(D8+F8+H8+J8+L8+N8)/6","v":{"v":0,"d":"0.0"}},{"$f":"IF(O8=3,\"B\",IF(O8>=2,\"C\",\"HC\"))","v":"HC"},{"$f":"IF(P8=3,\"B\",IF(P8>=2,\"C\",\"HC\"))","v":"HC"}]
[3,{"$f":"дети!A3","v":0},{"v":0,"d":"0.0"},{"v":0,"d":"0.0"},{"v":0,"d":"0.0"},{"v":0,"d":"0.0"},{"v":0,"d":"0.0"},{"v":0,"d":"0.0"},{"v":0,"d":"0.0"},{"v":0,"d":"0.0"},{"v":0,"d":"0.0"},{"v":0,"d":"0.0"},{"v":0,"d":"0.0"},{"v":0,"d":"0.0"},{"v":0,"d":"0.0"},{"v":0,"d":"0.0"},"HC","HC"]
[4,{"$f":"дети!A4","v":0},{"v":0,"d":"0.0"},{"v":0,"d":"0.0"},{"v":0,"d":"0.0"},{"v":0,"d":"0.0"},{"v":0,"d":"0.0"},{"v":0,"d":"0.0"},{"v":0,"d":"0.0"},{"v":0,"d":"0.0"},{"v":0,"d":"0.0"},{"v":0,"d":"0.0"},{"v":0,"d":"0.0"},{"v":0,"d":"0.0"},{"v":0,"d":"0.0"},{"v":0,"d":"0.0"},"HC","HC"]
[5,{"$f":"дети!A5","v":0},{"v":0,"d":"0.0"},{"v":0,"d":"0.0"},{"v":0,"d":"0.0"},{"v":0,"d":"0.0"},{"v":0,"d":"0.0"},{"v":0,"d":"0.0"},{"v":0,"d":"0.0"},{"v":0,"d":"0.0"},{"v":0,"d":"0.0"},{"v":0,"d":"0.0"},{"v":0,"d":"0.0"},{"v":0,"d":"0.0"},{"v":0,"d":"0.0"},{"v":0,"d":"0.0"},"HC","HC"]
[6,{"$f":"дети!A6","v":0},{"v":0,"d":"0.0"},{"v":0,"d":"0.0"},{"v":0,"d":"0.0"},{"v":0,"d":"0.0"},{"v":0,"d":"0.0"},{"v":0,"d":"0.0"},{"v":0,"d":"0.0"},{"v":0,"d":"0.0"},{"v":0,"d":"0.0"},{"v":0,"d":"0.0"},{"v":0,"d":"0.0"},{"v":0,"d":"0.0"},{"v":0,"d":"0.0"},{"v":0,"d":"0.0"},"HC","HC"]
[7,{"$f":"дети!A7","v":0},{"v":0,"d":"0.0"},{"v":0,"d":"0.0"},{"v":0,"d":"0.0"},{"v":0,"d":"0.0"},{"v":0,"d":"0.0"},{"v":0,"d":"0.0"},{"v":0,"d":"0.0"},{"v":0,"d":"0.0"},{"v":0,"d":"0.0"},{"v":0,"d":"0.0"},{"v":0,"d":"0.0"},{"v":0,"d":"0.0"},{"v":0,"d":"0.0"},{"v":0,"d":"0.0"},"HC","HC"]
[8,{"$f":"дети!A8","v":0},{"v":0,"d":"0.0"},{"v":0,"d":"0.0"},{"v":0,"d":"0.0"},{"v":0,"d":"0.0"},{"v":0,"d":"0.0"},{"v":0,"d":"0.0"},{"v":0,"d":"0.0"},{"v":0,"d":"0.0"},{"v":0,"d":"0.0"},{"v":0,"d":"0.0"},{"v":0,"d":"0.0"},{"v":0,"d":"0.0"},{"v":0,"d":"0.0"},{"v":0,"d":"0.0"},"HC","HC"]
[9,{"$f":"дети!A9","v":0},{"v":0,"d":"0.0"},{"v":0,"d":"0.0"},{"v":0,"d":"0.0"},{"v":0,"d":"0.0"},{"v":0,"d":"0.0"},{"v":0,"d":"0.0"},{"v":0,"d":"0.0"},{"v":0,"d":"0.0"},{"v":0,"d":"0.0"},{"v":0,"d":"0.0"},{"v":0,"d":"0.0"},{"v":0,"d":"0.0"},{"v":0,"d":"0.0"},{"v":0,"d":"0.0"},"HC","HC"]
[10,{"$f":"дети!A10","v":0},{"v":0,"d":"0.0"},{"v":0,"d":"0.0"},{"v":0,"d":"0.0"},{"v":0,"d":"0.0"},{"v":0,"d":"0.0"},{"v":0,"d":"0.0"},{"v":0,"d":"0.0"},{"v":0,"d":"0.0"},{"v":0,"d":"0.0"},{"v":0,"d":"0.0"},{"v":0,"d":"0.0"},{"v":0,"d":"0.0"},{"v":0,"d":"0.0"},{"v":0,"d":"0.0"},"HC","HC"]
[11,{"$f":"дети!A11","v":0},{"v":0,"d":"0.0"},{"v":0,"d":"0.0"},{"v":0,"d":"0.0"},{"v":0,"d":"0.0"},{"v":0,"d":"0.0"},{"v":0,"d":"0.0"},{"v":0,"d":"0.0"},{"v":0,"d":"0.0"},{"v":0,"d":"0.0"},{"v":0,"d":"0.0"},{"v":0,"d":"0.0"},{"v":0,"d":"0.0"},{"v":0,"d":"0.0"},{"v":0,"d":"0.0"},"HC","HC"]
[12,{"$f":"дети!A12","v":0},{"v":0,"d":"0.0"},{"v":0,"d":"0.0"},{"v":0,"d":"0.0"},{"v":0,"d":"0.0"},{"v":0,"d":"0.0"},{"v":0,"d":"0.0"},{"v":0,"d":"0.0"},{"v":0,"d":"0.0"},{"v":0,"d":"0.0"},{"v":0,"d":"0.0"},{"v":0,"d":"0.0"},{"v":0,"d":"0.0"},{"v":0,"d":"0.0"},{"v":0,"d":"0.0"},"HC","HC"]
[13,{"$f":"дети!A13","v":0},{"v":0,"d":"0.0"},{"v":0,"d":"0.0"},{"v":0,"d":"0.0"},{"v":0,"d":"0.0"},{"v":0,"d":"0.0"},{"v":0,"d":"0.0"},{"v":0,"d":"0.0"},{"v":0,"d":"0.0"},{"v":0,"d":"0.0"},{"v":0,"d":"0.0"},{"v":0,"d":"0.0"},{"v":0,"d":"0.0"},{"v":0,"d":"0.0"},{"v":0,"d":"0.0"},"HC","HC"]
[14,{"$f":"дети!A14","v":0},{"v":0,"d":"0.0"},{"v":0,"d":"0.0"},{"v":0,"d":"0.0"},{"v":0,"d":"0.0"},{"v":0,"d":"0.0"},{"v":0,"d":"0.0"},{"v":0,"d":"0.0"},{"v":0,"d":"0.0"},{"v":0,"d":"0.0"},{"v":0,"d":"0.0"},{"v":0,"d":"0.0"},{"v":0,"d":"0.0"},{"v":0,"d":"0.0"},{"v":0,"d":"0.0"},"HC","HC"]
[15,{"$f":"дети!A15","v":0},{"v":0,"d":"0.0"},{"v":0,"d":"0.0"},{"v":0,"d":"0.0"},{"v":0,"d":"0.0"},{"v":0,"d":"0.0"},{"v":0,"d":"0.0"},{"v":0,"d":"0.0"},{"v":0,"d":"0.0"},{"v":0,"d":"0.0"},{"v":0,"d":"0.0"},{"v":0,"d":"0.0"},{"v":0,"d":"0.0"},{"v":0,"d":"0.0"},{"v":0,"d":"0.0"},"HC","HC"]
[16,{"$f":"дети!A16","v":0},{"v":0,"d":"0.0"},{"v":0,"d":"0.0"},{"v":0,"d":"0.0"},{"v":0,"d":"0.0"},{"v":0,"d":"0.0"},{"v":0,"d":"0.0"},{"v":0,"d":"0.0"},{"v":0,"d":"0.0"},{"v":0,"d":"0.0"},{"v":0,"d":"0.0"},{"v":0,"d":"0.0"},{"v":0,"d":"0.0"},{"v":0,"d":"0.0"},{"v":0,"d":"0.0"},"HC","HC"]
[17,{"$f":"дети!A17","v":0},{"v":0,"d":"0.0"},{"v":0,"d":"0.0"},{"v":0,"d":"0.0"},{"v":0,"d":"0.0"},{"v":0,"d":"0.0"},{"v":0,"d":"0.0"},{"v":0,"d":"0.0"},{"v":0,"d":"0.0"},{"v":0,"d":"0.0"},{"v":0,"d":"0.0"},{"v":0,"d":"0.0"},{"v":0,"d":"0.0"},{"v":0,"d":"0.0"},{"v":0,"d":"0.0"},"HC","HC"]
[18,{"$f":"дети!A18","v":0},{"v":0,"d":"0.0"},{"v":0,"d":"0.0"},{"v":0,"d":"0.0"},{"v":0,"d":"0.0"},{"v":0,"d":"0.0"},{"v":0,"d":"0.0"},{"v":0,"d":"0.0"},{"v":0,"d":"0.0"},{"v":0,"d":"0.0"},{"v":0,"d":"0.0"},{"v":0,"d":"0.0"},{"v":0,"d":"0.0"},{"v":0,"d":"0.0"},{"v":0,"d":"0.0"},"HC","HC"]
[19,{"$f":"дети!A19","v":0},{"v":0,"d":"0.0"},{"v":0,"d":"0.0"},{"v":0,"d":"0.0"},{"v":0,"d":"0.0"},{"v":0,"d":"0.0"},{"v":0,"d":"0.0"},{"v":0,"d":"0.0"},{"v":0,"d":"0.0"},{"v":0,"d":"0.0"},{"v":0,"d":"0.0"},{"v":0,"d":"0.0"},{"v":0,"d":"0.0"},{"v":0,"d":"0.0"},{"v":0,"d":"0.0"},"HC","HC"]
[20,{"$f":"дети!A20","v":0},{"v":0,"d":"0.0"},{"v":0,"d":"0.0"},{"v":0,"d":"0.0"},{"v":0,"d":"0.0"},{"v":0,"d":"0.0"},{"v":0,"d":"0.0"},{"v":0,"d":"0.0"},{"v":0,"d":"0.0"},{"v":0,"d":"0.0"},{"v":0,"d":"0.0"},{"v":0,"d":"0.0"},{"v":0,"d":"0.0"},{"v":0,"d":"0.0"},{"v":0,"d":"0.0"},"HC","HC"]
[21,{"$f":"дети!A21","v":0},{"v":0,"d":"0.0"},{"v":0,"d":"0.0"},{"v":0,"d":"0.0"},{"v":0,"d":"0.0"},{"v":0,"d":"0.0"},{"v":0,"d":"0.0"},{"v":0,"d":"0.0"},{"v":0,"d":"0.0"},{"v":0,"d":"0.0"},{"v":0,"d":"0.0"},{"v":0,"d":"0.0"},{"v":0,"d":"0.0"},{"v":0,"d":"0.0"},{"v":0,"d":"0.0"},"HC","HC"]
[22,{"$f":"дети!A22","v":0},{"v":0,"d":"0.0"},{"v":0,"d":"0.0"},{"v":0,"d":"0.0"},{"v":0,"d":"0.0"},{"v":0,"d":"0.0"},{"v":0,"d":"0.0"},{"v":0,"d":"0.0"},{"v":0,"d":"0.0"},{"v":0,"d":"0.0"},{"v":0,"d":"0.0"},{"v":0,"d":"0.0"},{"v":0,"d":"0.0"},{"v":0,"d":"0.0"},{"v":0,"d":"0.0"},"HC","HC"]
[23,{"$f":"дети!A23","v":0},{"v":0,"d":"0.0"},{"v":0,"d":"0.0"},{"v":0,"d":"0.0"},{"v":0,"d":"0.0"},{"v":0,"d":"0.0"},{"v":0,"d":"0.0"},{"v":0,"d":"0.0"},{"v":0,"d":"0.0"},{"v":0,"d":"0.0"},{"v":0,"d":"0.0"},{"v":0,"d":"0.0"},{"v":0,"d":"0.0"},{"v":0,"d":"0.0"},{"v":0,"d":"0.0"},"HC","HC"]
[24,{"$f":"дети!A24","v":0},{"v":0,"d":"0.0"},{"v":0,"d":"0.0"},{"v":0,"d":"0.0"},{"v":0,"d":"0.0"},{"v":0,"d":"0.0"},{"v":0,"d":"0.0"},{"v":0,"d":"0.0"},{"v":0,"d":"0.0"},{"v":0,"d":"0.0"},{"v":0,"d":"0.0"},{"v":0,"d":"0.0"},{"v":0,"d":"0.0"},{"v":0,"d":"0.0"},{"v":0,"d":"0.0"},"HC","HC"]
[25,{"$f":"дети!A25","v":0},{"v":0,"d":"0.0"},{"v":0,"d":"0.0"},{"v":0,"d":"0.0"},{"v":0,"d":"0.0"},{"v":0,"d":"0.0"},{"v":0,"d":"0.0"},{"v":0,"d":"0.0"},{"v":0,"d":"0.0"},{"v":0,"d":"0.0"},{"v":0,"d":"0.0"},{"v":0,"d":"0.0"},{"v":0,"d":"0.0"},{"v":0,"d":"0.0"},{"v":0,"d":"0.0"},"HC","HC"]
[26,{"$f":"дети!A26","v":0},{"v":0,"d":"0.0"},{"v":0,"d":"0.0"},{"v":0,"d":"0.0"},{"v":0,"d":"0.0"},{"v":0,"d":"0.0"},{"v":0,"d":"0.0"},{"v":0,"d":"0.0"},{"v":0,"d":"0.0"},{"v":0,"d":"0.0"},{"v":0,"d":"0.0"},{"v":0,"d":"0.0"},{"v":0,"d":"0.0"},{"v":0,"d":"0.0"},{"v":0,"d":"0.0"},"HC","HC"]
[27,{"$f":"дети!A27","v":0},{"v":0,"d":"0.0"},{"v":0,"d":"0.0"},{"v":0,"d":"0.0"},{"v":0,"d":"0.0"},{"v":0,"d":"0.0"},{"v":0,"d":"0.0"},{"v":0,"d":"0.0"},{"v":0,"d":"0.0"},{"v":0,"d":"0.0"},{"v":0,"d":"0.0"},{"v":0,"d":"0.0"},{"v":0,"d":"0.0"},{"v":0,"d":"0.0"},{"v":0,"d":"0.0"},"HC","HC"]
[28,{"$f":"дети!A28","v":0},{"v":0,"d":"0.0"},{"v":0,"d":"0.0"},{"v":0,"d":"0.0"},{"v":0,"d":"0.0"},{"v":0,"d":"0.0"},{"v":0,"d":"0.0"},{"v":0,"d":"0.0"},{"v":0,"d":"0.0"},{"v":0,"d":"0.0"},{"v":0,"d":"0.0"},{"v":0,"d":"0.0"},{"v":0,"d":"0.0"},{"v":0,"d":"0.0"},{"v":0,"d":"0.0"},"HC","HC"]
["Итоговый пок-ль по группе (ср. значение)",null,{"$f":"SUM(C7:C34)/дети!G2","v":{"$error":"#DIV/0!"}},{"$f":"SUM(D7:D34)/дети!G2","v":{"$error":"#DIV/0!"}},{"$f":"SUM(E7:E34)/дети!G2","v":{"$error":"#DIV/0!"}},{"$f":"SUM(F7:F34)/дети!G2","v":{"$error":"#DIV/0!"}},{"$f":"SUM(G7:G34)/дети!G2","v":{"$error":"#DIV/0!"}},{"$f":"SUM(H7:H34)/дети!G2","v":{"$error":"#DIV/0!"}},{"$f":"SUM(I7:I34)/дети!G2","v":{"$error":"#DIV/0!"}},{"$f":"SUM(J7:J34)/дети!G2","v":{"$error":"#DIV/0!"}},{"$f":"SUM(K7:K34)/дети!G2","v":{"$error":"#DIV/0!"}},{"$f":"SUM(L7:L34)/дети!G2","v":{"$error":"#DIV/0!"}},{"$f":"SUM(M7:M34)/дети!G2","v":{"$error":"#DIV/0!"}},{"$f":"SUM(N7:N34)/дети!G2","v":{"$error":"#DIV/0!"}},{"$f":"SUM(O7:O34)/дети!G2","v":{"$error":"#DIV/0!"}},{"$f":"SUM(P7:P34)/дети!G2","v":{"$error":"#DIV/0!"}},{"$f":"SUM(Q7:Q34)/23","v":0},{"$f":"SUM(R7:R34)/23","v":0}]
[null,"\"3\" Сформирован (В)",{"$f":"COUNTIF(C7:C34,\"=3\")/дети!G2","v":{"$error":"#DIV/0!"}},{"$f":"COUNTIF(D7:D34,\"=3\")/дети!G2","v":{"$error":"#DIV/0!"}},{"$f":"COUNTIF(E7:E34,\"=3\")/дети!G2","v":{"$error":"#DIV/0!"}},{"$f":"COUNTIF(F7:F34,\"=3\")/дети!G2","v":{"$error":"#DIV/0!"}},{"$f":"COUNTIF(G7:G34,\"=3\")/дети!G2","v":{"$error":"#DIV/0!"}},{"$f":"COUNTIF(H7:H34,\"=3\")/дети!G2","v":{"$error":"#DIV/0!"}},{"$f":"COUNTIF(I7:I34,\"=3\")/дети!G2","v":{"$error":"#DIV/0!"}},{"$f":"COUNTIF(J7:J34,\"=3\")/дети!G2","v":{"$error":"#DIV/0!"}},{"$f":"COUNTIF(K7:K34,\"=3\")/дети!G2","v":{"$error":"#DIV/0!"}},{"$f":"COUNTIF(L7:L34,\"=3\")/дети!G2","v":{"$error":"#DIV/0!"}},{"$f":"COUNTIF(M7:M34,\"=3\")/дети!G2","v":{"$error":"#DIV/0!"}},{"$f":"COUNTIF(N7:N34,\"=3\")/дети!G2","v":{"$error":"#DIV/0!"}},{"$f":"COUNTIF(O7:O34,\"=3\")/дети!G2","v":{"$error":"#DIV/0!"}},{"$f":"COUNTIF(P7:P34,\"=3\")/дети!G2","v":{"$error":"#DIV/0!"}}]
[null,"\"2\" Находится в стадии формирования (С)",{"$f":"COUNTIF(C7:C34,\"=2\")/дети!G2","v":{"$error":"#DIV/0!"}},{"$f":"COUNTIF(D7:D34,\"=2\")/дети!G2","v":{"$error":"#DIV/0!"}},{"$f":"COUNTIF(E7:E34,\"=2\")/дети!G2","v":{"$error":"#DIV/0!"}},{"$f":"COUNTIF(F7:F34,\"=2\")/дети!G2","v":{"$error":"#DIV/0!"}},{"$f":"COUNTIF(G7:G34,\"=2\")/дети!G2","v":{"$error":"#DIV/0!"}},{"$f":"COUNTIF(H7:H34,\"=2\")/дети!G2","v":{"$error":"#DIV/0!"}},{"$f":"COUNTIF(I7:I34,\"=2\")/дети!G2","v":{"$error":"#DIV/0!"}},{"$f":"COUNTIF(J7:J34,\"=2\")/дети!G2","v":{"$error":"#DIV/0!"}},{"$f":"COUNTIF(K7:K34,\"=2\")/дети!G2","v":{"$error":"#DIV/0!"}},{"$f":"COUNTIF(L7:L34,\"=2\")/дети!G2","v":{"$error":"#DIV/0!"}},{"$f":"COUNTIF(M7:M34,\"=2\")/дети!G2","v":{"$error":"#DIV/0!"}},{"$f":"COUNTIF(N7:N34,\"=2\")/дети!G2","v":{"$error":"#DIV/0!"}},{"$f":"100%-(O38+O36)","v":{"$error":"#DIV/0!"}},{"$f":"100%-(P38+P36)","v":{"$error":"#DIV/0!"}}]
[null,"\"1\" Не сформирован (НС)",{"$f":"COUNTIF(C7:C34,\"=1\")/дети!G2","v":{"$error":"#DIV/0!"}},{"$f":"COUNTIF(D7:D34,\"=1\")/дети!G2","v":{"$error":"#DIV/0!"}},{"$f":"COUNTIF(E7:E34,\"=1\")/дети!G2","v":{"$error":"#DIV/0!"}},{"$f":"COUNTIF(F7:F34,\"=1\")/дети!G2","v":{"$error":"#DIV/0!"}},{"$f":"COUNTIF(G7:G34,\"=1\")/дети!G2","v":{"$error":"#DIV/0!"}},{"$f":"COUNTIF(H7:H34,\"=1\")/дети!G2","v":{"$error":"#DIV/0!"}},{"$f":"COUNTIF(I7:I34,\"=1\")/дети!G2","v":{"$error":"#DIV/0!"}},{"$f":"COUNTIF(J7:J34,\"=1\")/дети!G2","v":{"$error":"#DIV/0!"}},{"$f":"COUNTIF(K7:K34,\"=1\")/дети!G2","v":{"$error":"#DIV/0!"}},{"$f":"COUNTIF(L7:L34,\"=1\")/дети!G2","v":{"$error":"#DIV/0!"}},{"$f":"COUNTIF(M7:M34,\"=1\")/дети!G2","v":{"$error":"#DIV/0!"}},{"$f":"COUNTIF(N7:N34,\"=1\")/дети!G2","v":{"$error":"#DIV/0!"}},{"$f":"COUNTIF(O7:O34,\"<2\")/дети!G2","v":{"$error":"#DIV/0!"}},{"$f":"COUNTIF(P7:P34,\"<2\")/дети!G2","v":{"$error":"#DIV/0!"}}]

{"sheet":"худ-эст","index":5,"n_rows":39,"n_cols":27,"rows_kept":39,"merged":[[4,0,6,0],[4,1,6,1],[4,2,5,3],[4,4,5,5],[4,6,5,7],[4,8,5,9],[4,10,5,11],[4,12,5,13],[4,14,5,15],[4,16,5,17],[4,18,5,19],[4,20,5,21],[35,0,35,1]]}
[null,{"$f":"дети!A38","v":"Мониторинг образовательного процесса группы № __  (младшая) на 20__-20__ уч.г."}]
[{"$f":"дети!A39","v":"Воспитатель: _____________________________"},{"$nulls":13}," ",null,null," "]
[{"$f":"дети!A40","v":"Воспитатель: ________________________________"},{"$nulls":15}," "," "]
[{"$nulls":3},"Мониторинг знаний 3-4 л.  по образовательной области «Художественно-эстетическое развитие» ",{"$nulls":13}," "," "]
["№ п/п","Фамилия, имя ребенка","Знает, называет и правильно использует детали строительного материала. Изменяет постройки, надстраивая или заменяя одни детали другими",null,"Изображает/ создает отдельные предметы, простые по композиции и по содержанию сюжеты,   используя   разные материалы",null,"Создает    изображения предметов из готовых фигур. Украшает заготовки из бумаги разной формы",null,"Умеет отделять от большого куска глины небольшие комочки, раскатывать их прямыми и круговыми движениями ладоней. Лепит различные предметы, состоящие из 1-3 частей, используя разнообразные приемы лепки",null,"Создает изображения предметов из готовых фигур. Украшает заготовки из бумаги разной формы.",null,"Слушает  музыкальное произведение до конца. Узнает  знакомые  песни.  Поет,  не отставая и не опережая других",null,"Умеет  выполнять танцевальные движения: кружиться в парах, притопывать   попеременно ногами,  двигаться   под музыку с предметами",null,"Различает  и называет музыкальные  инструменты:   металлофон, барабан.   Замечает   изменения   в   звучании (тихо-громко)",null,"Итоговый показа­тель по каждому ребенку (ср.значение)",null,"Уровень"]
[]
[null,null,"н.г.","к.г.","н.г.","к.г.","н.г.","к.г.","н.г.","к.г.","н.г.","к.г.","н.г.","к.г.","н.г.","к.г.","н.г.","к.г.","н.г.","к.г.","н.г.","к.г."]
[1,{"$f":"дети!A1","v":0},{"v":0,"d":"0.0"},{"v":0,"d":"0.0"},{"v":0,"d":"0.0"},{"v":0,"d":"0.0"},{"v":0,"d":"0.0"},{"v":0,"d":"0.0"},{"v":0,"d":"0.0"},{"v":0,"d":"0.0"},{"v":0,"d":"0.0"},{"v":0,"d":"0.0"},{"v":0,"d":"0.0"},{"v":0,"d":"0.0"},{"v":0,"d":"0.0"},{"v":0,"d":"0.0"},{"v":0,"d":"0.0"},{"v":0,"d":"0.0"},{"$f":"(C8+E8+G8+I8+K8+M8+O8+Q8)/8","v":{"v":0,"d":"0.0"}},{"$f":"(D8+F8+H8+J8+L8+N8+P8+R8)/8","v":{"v":0,"d":"0.0"}},{"$f":"IF(S8=3,\"B\",IF(S8>=2,\"C\",\"HC\"))","v":"HC"},{"$f":"IF(T8=3,\"B\",IF(T8>=2,\"C\",\"HC\"))","v":"HC"}]
[2,{"$f":"дети!A2","v":0},{"v":0,"d":"0.0"},{"v":0,"d":"0.0"},{"v":0,"d":"0.0"},{"v":0,"d":"0.0"},{"v":0,"d":"0.0"},{"v":0,"d":"0.0"},{"v":0,"d":"0.0"},{"v":0,"d":"0.0"},{"v":0,"d":"0.0"},{"v":0,"d":"0.0"},{"v":0,"d":"0.0"},{"v":0,"d":"0.0"},{"v":0,"d":"0.0"},{"v":0,"d":"0.0"},{"v":0,"d":"0.0"},{"v":0,"d":"0.0"},{"$f":"(C9+E9+G9+I9+K9+M9+O9+Q9)/8","v":{"v":0,"d":"0.0"}},{"$f":"(D9+F9+H9+J9+L9+N9+P9+R9)/8","v":{"v":0,"d":"0.0"}},{"$f":"IF(S9=3,\"B\",IF(S9>=2,\"C\",\"HC\"))","v":"HC"},{"$f":"IF(T9=3,\"B\",IF(T9>=2,\"C\",\"HC\"))","v":"HC"}]
[3,{"$f":"дети!A3","v":0},{"v":0,"d":"0.0"},{"v":0,"d":"0.0"},{"v":0,"d":"0.0"},{"v":0,"d":"0.0"},{"v":0,"d":"0.0"},{"v":0,"d":"0.0"},{"v":0,"d":"0.0"},{"v":0,"d":"0.0"},{"v":0,"d":"0.0"},{"v":0,"d":"0.0"},{"v":0,"d":"0.0"},{"v":0,"d":"0.0"},{"v":0,"d":"0.0"},{"v":0,"d":"0.0"},{"v":0,"d":"0.0"},{"v":0,"d":"0.0"},{"v":0,"d":"0.0"},{"v":0,"d":"0.0"},"HC","HC"]
[4,{"$f":"дети!A4","v":0},{"v":0,"d":"0.0"},{"v":0,"d":"0.0"},{"v":0,"d":"0.0"},{"v":0,"d":"0.0"},{"v":0,"d":"0.0"},{"v":0,"d":"0.0"},{"v":0,"d":"0.0"},{"v":0,"d":"0.0"},{"v":0,"d":"0.0"},{"v":0,"d":"0.0"},{"v":0,"d":"0.0"},{"v":0,"d":"0.0"},{"v":0,"d":"0.0"},{"v":0,"d":"0.0"},{"v":0,"d":"0.0"},{"v":0,"d":"0.0"},{"v":0,"d":"0.0"},{"v":0,"d":"0.0"},"HC","HC"]
[5,{"$f":"дети!A5","v":0},{"v":0,"d":"0.0"},{"v":0,"d":"0.0"},{"v":0,"d":"0.0"},{"v":0,"d":"0.0"},{"v":0,"d":"0.0"},{"v":0,"d":"0.0"},{"v":0,"d":"0.0"},{"v":0,"d":"0.0"},{"v":0,"d":"0.0"},{"v":0,"d":"0.0"},{"v":0,"d":"0.0"},{"v":0,"d":"0.0"},{"v":0,"d":"0.0"},{"v":0,"d":"0.0"},{"v":0,"d":"0.0"},{"v":0,"d":"0.0"},{"v":0,"d":"0.0"},{"v":0,"d":"0.0"},"HC","HC"]
[6,{"$f":"дети!A6","v":0},{"v":0,"d":"0.0"},{"v":0,"d":"0.0"},{"v":0,"d":"0.0"},{"v":0,"d":"0.0"},{"v":0,"d":"0.0"},{"v":0,"d":"0.0"},{"v":0,"d":"0.0"},{"v":0,"d":"0.0"},{"v":0,"d":"0.0"},{"v":0,"d":"0.0"},{"v":0,"d":"0.0"},{"v":0,"d":"0.0"},{"v":0,"d":"0.0"},{"v":0,"d":"0.0"},{"v":0,"d":"0.0"},{"v":0,"d":"0.0"},{"v":0,"d":"0.0"},{"v":0,"d":"0.0"},"HC","HC"]
[7,{"$f":"дети!A7","v":0},{"v":0,"d":"0.0"},{"v":0,"d":"0.0"},{"v":0,"d":"0.0"},{"v":0,"d":"0.0"},{"v":0,"d":"0.0"},{"v":0,"d":"0.0"},{"v":0,"d":"0.0"},{"v":0,"d":"0.0"},{"v":0,"d":"0.0"},{"v":0,"d":"0.0"},{"v":0,"d":"0.0"},{"v":0,"d":"0.0"},{"v":0,"d":"0.0"},{"v":0,"d":"0.0"},{"v":0,"d":"0.0"},{"v":0,"d":"0.0"},{"v":0,"d":"0.0"},{"v":0,"d":"0.0"},"HC","HC"]
[8,{"$f":"дети!A8","v":0},{"v":0,"d":"0.0"},{"v":0,"d":"0.0"},{"v":0,"d":"0.0"},{"v":0,"d":"0.0"},{"v":0,"d":"0.0"},{"v":0,"d":"0.0"},{"v":0,"d":"0.0"},{"v":0,"d":"0.0"},{"v":0,"d":"0.0"},{"v":0,"d":"0.0"},{"v":0,"d":"0.0"},{"v":0,"d":"0.0"},{"v":0,"d":"0.0"},{"v":0,"d":"0.0"},{"v":0,"d":"0.0"},{"v":0,"d":"0.0"},{"v":0,"d":"0.0"},{"v":0,"d":"0.0"},"HC","HC"]
[9,{"$f":"дети!A9","v":0},{"v":0,"d":"0.0"},{"v":0,"d":"0.0"},{"v":0,"d":"0.0"},{"v":0,"d":"0.0"},{"v":0,"d":"0.0"},{"v":0,"d":"0.0"},{"v":0,"d":"0.0"},{"v":0,"d":"0.0"},{"v":0,"d":"0.0"},{"v":0,"d":"0.0"},{"v":0,"d":"0.0"},{"v":0,"d":"0.0"},{"v":0,"d":"0.0"},{"v":0,"d":"0.0"},{"v":0,"d":"0.0"},{"v":0,"d":"0.0"},{"v":0,"d":"0.0"},{"v":0,"d":"0.0"},"HC","HC"]
[10,{"$f":"дети!A10","v":0},{"v":0,"d":"0.0"},{"v":0,"d":"0.0"},{"v":0,"d":"0.0"},{"v":0,"d":"0.0"},{"v":0,"d":"0.0"},{"v":0,"d":"0.0"},{"v":0,"d":"0.0"},{"v":0,"d":"0.0"},{"v":0,"d":"0.0"},{"v":0,"d":"0.0"},{"v":0,"d":"0.0"},{"v":0,"d":"0.0"},{"v":0,"d":"0.0"},{"v":0,"d":"0.0"},{"v":0,"d":"0.0"},{"v":0,"d":"0.0"},{"v":0,"d":"0.0"},{"v":0,"d":"0.0"},"HC","HC"]
[11,{"$f":"дети!A11","v":0},{"v":0,"d":"0.0"},{"v":0,"d":"0.0"},{"v":0,"d":"0.0"},{"v":0,"d":"0.0"},{"v":0,"d":"0.0"},{"v":0,"d":"0.0"},{"v":0,"d":"0.0"},{"v":0,"d":"0.0"},{"v":0,"d":"0.0"},{"v":0,"d":"0.0"},{"v":0,"d":"0.0"},{"v":0,"d":"0.0"},{"v":0,"d":"0.0"},{"v":0,"d":"0.0"},{"v":0,"d":"0.0"},{"v":0,"d":"0.0"},{"v":0,"d":"0.0"},{"v":0,"d":"0.0"},"HC","HC",{"$nulls":4}," "]
[12,{"$f":"дети!A12","v":0},{"v":0,"d":"0.0"},{"v":0,"d":"0.0"},{"v":0,"d":"0.0"},{"v":0,"d":"0.0"},{"v":0,"d":"0.0"},{"v":0,"d":"0.0"},{"v":0,"d":"0.0"},{"v":0,"d":"0.0"},{"v":0,"d":"0.0"},{"v":0,"d":"0.0"},{"v":0,"d":"0.0"},{"v":0,"d":"0.0"},{"v":0,"d":"0.0"},{"v":0,"d":"0.0"},{"v":0,"d":"0.0"},{"v":0,"d":"0.0"},{"v":0,"d":"0.0"},{"v":0,"d":"0.0"},"HC","HC"]
[13,{"$f":"дети!A13","v":0},{"v":0,"d":"0.0"},{"v":0,"d":"0.0"},{"v":0,"d":"0.0"},{"v":0,"d":"0.0"},{"v":0,"d":"0.0"},{"v":0,"d":"0.0"},{"v":0,"d":"0.0"},{"v":0,"d":"0.0"},{"v":0,"d":"0.0"},{"v":0,"d":"0.0"},{"v":0,"d":"0.0"},{"v":0,"d":"0.0"},{"v":0,"d":"0.0"},{"v":0,"d":"0.0"},{"v":0,"d":"0.0"},{"v":0,"d":"0.0"},{"v":0,"d":"0.0"},{"v":0,"d":"0.0"},"HC","HC"]
[14,{"$f":"дети!A14","v":0},{"v":0,"d":"0.0"},{"v":0,"d":"0.0"},{"v":0,"d":"0.0"},{"v":0,"d":"0.0"},{"v":0,"d":"0.0"},{"v":0,"d":"0.0"},{"v":0,"d":"0.0"},{"v":0,"d":"0.0"},{"v":0,"d":"0.0"},{"v":0,"d":"0.0"},{"v":0,"d":"0.0"},{"v":0,"d":"0.0"},{"v":0,"d":"0.0"},{"v":0,"d":"0.0"},{"v":0,"d":"0.0"},{"v":0,"d":"0.0"},{"v":0,"d":"0.0"},{"v":0,"d":"0.0"},"HC","HC"]
[15,{"$f":"дети!A15","v":0},{"v":0,"d":"0.0"},{"v":0,"d":"0.0"},{"v":0,"d":"0.0"},{"v":0,"d":"0.0"},{"v":0,"d":"0.0"},{"v":0,"d":"0.0"},{"v":0,"d":"0.0"},{"v":0,"d":"0.0"},{"v":0,"d":"0.0"},{"v":0,"d":"0.0"},{"v":0,"d":"0.0"},{"v":0,"d":"0.0"},{"v":0,"d":"0.0"},{"v":0,"d":"0.0"},{"v":0,"d":"0.0"},{"v":0,"d":"0.0"},{"v":0,"d":"0.0"},{"v":0,"d":"0.0"},"HC","HC"]
[16,{"$f":"дети!A16","v":0},{"v":0,"d":"0.0"},{"v":0,"d":"0.0"},{"v":0,"d":"0.0"},{"v":0,"d":"0.0"},{"v":0,"d":"0.0"},{"v":0,"d":"0.0"},{"v":0,"d":"0.0"},{"v":0,"d":"0.0"},{"v":0,"d":"0.0"},{"v":0,"d":"0.0"},{"v":0,"d":"0.0"},{"v":0,"d":"0.0"},{"v":0,"d":"0.0"},{"v":0,"d":"0.0"},{"v":0,"d":"0.0"},{"v":0,"d":"0.0"},{"v":0,"d":"0.0"},{"v":0,"d":"0.0"},"HC","HC"]
[17,{"$f":"дети!A17","v":0},{"v":0,"d":"0.0"},{"v":0,"d":"0.0"},{"v":0,"d":"0.0"},{"v":0,"d":"0.0"},{"v":0,"d":"0.0"},{"v":0,"d":"0.0"},{"v":0,"d":"0.0"},{"v":0,"d":"0.0"},{"v":0,"d":"0.0"},{"v":0,"d":"0.0"},{"v":0,"d":"0.0"},{"v":0,"d":"0.0"},{"v":0,"d":"0.0"},{"v":0,"d":"0.0"},{"v":0,"d":"0.0"},{"v":0,"d":"0.0"},{"v":0,"d":"0.0"},{"v":0,"d":"0.0"},"HC","HC"]
[18,{"$f":"дети!A18","v":0},{"v":0,"d":"0.0"},{"v":0,"d":"0.0"},{"v":0,"d":"0.0"},{"v":0,"d":"0.0"},{"v":0,"d":"0.0"},{"v":0,"d":"0.0"},{"v":0,"d":"0.0"},{"v":0,"d":"0.0"},{"v":0,"d":"0.0"},{"v":0,"d":"0.0"},{"v":0,"d":"0.0"},{"v":0,"d":"0.0"},{"v":0,"d":"0.0"},{"v":0,"d":"0.0"},{"v":0,"d":"0.0"},{"v":0,"d":"0.0"},{"v":0,"d":"0.0"},{"v":0,"d":"0.0"},"HC","HC"]
[19,{"$f":"дети!A19","v":0},{"v":0,"d":"0.0"},{"v":0,"d":"0.0"},{"v":0,"d":"0.0"},{"v":0,"d":"0.0"},{"v":0,"d":"0.0"},{"v":0,"d":"0.0"},{"v":0,"d":"0.0"},{"v":0,"d":"0.0"},{"v":0,"d":"0.0"},{"v":0,"d":"0.0"},{"v":0,"d":"0.0"},{"v":0,"d":"0.0"},{"v":0,"d":"0.0"},{"v":0,"d":"0.0"},{"v":0,"d":"0.0"},{"v":0,"d":"0.0"},{"v":0,"d":"0.0"},{"v":0,"d":"0.0"},"HC","HC"]
[20,{"$f":"дети!A20","v":0},{"v":0,"d":"0.0"},{"v":0,"d":"0.0"},{"v":0,"d":"0.0"},{"v":0,"d":"0.0"},{"v":0,"d":"0.0"},{"v":0,"d":"0.0"},{"v":0,"d":"0.0"},{"v":0,"d":"0.0"},{"v":0,"d":"0.0"},{"v":0,"d":"0.0"},{"v":0,"d":"0.0"},{"v":0,"d":"0.0"},{"v":0,"d":"0.0"},{"v":0,"d":"0.0"},{"v":0,"d":"0.0"},{"v":0,"d":"0.0"},{"v":0,"d":"0.0"},{"v":0,"d":"0.0"},"HC","HC"]
[21,{"$f":"дети!A21","v":0},{"v":0,"d":"0.0"},{"v":0,"d":"0.0"},{"v":0,"d":"0.0"},{"v":0,"d":"0.0"},{"v":0,"d":"0.0"},{"v":0,"d":"0.0"},{"v":0,"d":"0.0"},{"v":0,"d":"0.0"},{"v":0,"d":"0.0"},{"v":0,"d":"0.0"},{"v":0,"d":"0.0"},{"v":0,"d":"0.0"},{"v":0,"d":"0.0"},{"v":0,"d":"0.0"},{"v":0,"d":"0.0"},{"v":0,"d":"0.0"},{"v":0,"d":"0.0"},{"v":0,"d":"0.0"},"HC","HC"]
[22,{"$f":"дети!A22","v":0},{"v":0,"d":"0.0"},{"v":0,"d":"0.0"},{"v":0,"d":"0.0"},{"v":0,"d":"0.0"},{"v":0,"d":"0.0"},{"v":0,"d":"0.0"},{"v":0,"d":"0.0"},{"v":0,"d":"0.0"},{"v":0,"d":"0.0"},{"v":0,"d":"0.0"},{"v":0,"d":"0.0"},{"v":0,"d":"0.0"},{"v":0,"d":"0.0"},{"v":0,"d":"0.0"},{"v":0,"d":"0.0"},{"v":0,"d":"0.0"},{"v":0,"d":"0.0"},{"v":0,"d":"0.0"},"HC","HC"]
[23,{"$f":"дети!A23","v":0},{"v":0,"d":"0.0"},{"v":0,"d":"0.0"},{"v":0,"d":"0.0"},{"v":0,"d":"0.0"},{"v":0,"d":"0.0"},{"v":0,"d":"0.0"},{"v":0,"d":"0.0"},{"v":0,"d":"0.0"},{"v":0,"d":"0.0"},{"v":0,"d":"0.0"},{"v":0,"d":"0.0"},{"v":0,"d":"0.0"},{"v":0,"d":"0.0"},{"v":0,"d":"0.0"},{"v":0,"d":"0.0"},{"v":0,"d":"0.0"},{"v":0,"d":"0.0"},{"v":0,"d":"0.0"},"HC","HC"]
[24,{"$f":"дети!A24","v":0},{"v":0,"d":"0.0"},{"v":0,"d":"0.0"},{"v":0,"d":"0.0"},{"v":0,"d":"0.0"},{"v":0,"d":"0.0"},{"v":0,"d":"0.0"},{"v":0,"d":"0.0"},{"v":0,"d":"0.0"},{"v":0,"d":"0.0"},{"v":0,"d":"0.0"},{"v":0,"d":"0.0"},{"v":0,"d":"0.0"},{"v":0,"d":"0.0"},{"v":0,"d":"0.0"},{"v":0,"d":"0.0"},{"v":0,"d":"0.0"},{"v":0,"d":"0.0"},{"v":0,"d":"0.0"},"HC","HC"]
[25,{"$f":"дети!A25","v":0},{"v":0,"d":"0.0"},{"v":0,"d":"0.0"},{"v":0,"d":"0.0"},{"v":0,"d":"0.0"},{"v":0,"d":"0.0"},{"v":0,"d":"0.0"},{"v":0,"d":"0.0"},{"v":0,"d":"0.0"},{"v":0,"d":"0.0"},{"v":0,"d":"0.0"},{"v":0,"d":"0.0"},{"v":0,"d":"0.0"},{"v":0,"d":"0.0"},{"v":0,"d":"0.0"},{"v":0,"d":"0.0"},{"v":0,"d":"0.0"},{"v":0,"d":"0.0"},{"v":0,"d":"0.0"},"HC","HC"]
[26,{"$f":"дети!A26","v":0},{"v":0,"d":"0.0"},{"v":0,"d":"0.0"},{"v":0,"d":"0.0"},{"v":0,"d":"0.0"},{"v":0,"d":"0.0"},{"v":0,"d":"0.0"},{"v":0,"d":"0.0"},{"v":0,"d":"0.0"},{"v":0,"d":"0.0"},{"v":0,"d":"0.0"},{"v":0,"d":"0.0"},{"v":0,"d":"0.0"},{"v":0,"d":"0.0"},{"v":0,"d":"0.0"},{"v":0,"d":"0.0"},{"v":0,"d":"0.0"},{"v":0,"d":"0.0"},{"v":0,"d":"0.0"},"HC","HC"]
[27,{"$f":"дети!A27","v":0},{"v":0,"d":"0.0"},{"v":0,"d":"0.0"},{"v":0,"d":"0.0"},{"v":0,"d":"0.0"},{"v":0,"d":"0.0"},{"v":0,"d":"0.0"},{"v":0,"d":"0.0"},{"v":0,"d":"0.0"},{"v":0,"d":"0.0"},{"v":0,"d":"0.0"},{"v":0,"d":"0.0"},{"v":0,"d":"0.0"},{"v":0,"d":"0.0"},{"v":0,"d":"0.0"},{"v":0,"d":"0.0"},{"v":0,"d":"0.0"},{"v":0,"d":"0.0"},{"v":0,"d":"0.0"},"HC","HC"]
[28,{"$f":"дети!A28","v":0},{"v":0,"d":"0.0"},{"v":0,"d":"0.0"},{"v":0,"d":"0.0"},{"v":0,"d":"0.0"},{"v":0,"d":"0.0"},{"v":0,"d":"0.0"},{"v":0,"d":"0.0"},{"v":0,"d":"0.0"},{"v":0,"d":"0.0"},{"v":0,"d":"0.0"},{"v":0,"d":"0.0"},{"v":0,"d":"0.0"},{"v":0,"d":"0.0"},{"v":0,"d":"0.0"},{"v":0,"d":"0.0"},{"v":0,"d":"0.0"},{"v":0,"d":"0.0"},{"v":0,"d":"0.0"},"HC","HC"]
["Итоговый пок-ль по группе (ср. знач.)",null,{"$f":"SUM(C8:C35)/дети!G2","v":{"$error":"#DIV/0!"}},{"$f":"SUM(D8:D35)/дети!G2","v":{"$error":"#DIV/0!"}},{"$f":"SUM(E8:E35)/23","v":{"v":0,"d":"0.0"}},{"$f":"SUM(F8:F35)/дети!G2","v":{"$error":"#DIV/0!"}},{"$f":"SUM(G8:G35)/23","v":{"v":0,"d":"0.0"}},{"$f":"SUM(H8:H35)/дети!G2","v":{"$error":"#DIV/0!"}},{"$f":"SUM(I8:I35)/23","v":{"v":0,"d":"0.0"}},{"$f":"SUM(J8:J35)/дети!G2","v":{"$error":"#DIV/0!"}},{"$f":"SUM(K8:K35)/дети!G2","v":{"$error":"#DIV/0!"}},{"$f":"SUM(L8:L35)/дети!G2","v":{"$error":"#DIV/0!"}},{"$f":"SUM(M8:M35)/23","v":{"v":0,"d":"0.0"}},{"$f":"SUM(N8:N35)/дети!G2","v":{"$error":"#DIV/0!"}},{"$f":"SUM(O8:O35)/23","v":{"v":0,"d":"0.0"}},{"$f":"SUM(P8:P35)/дети!G2","v":{"$error":"#DIV/0!"}},{"$f":"SUM(Q8:Q35)/23","v":{"v":0,"d":"0.0"}},{"$f":"SUM(R8:R35)/дети!G2","v":{"$error":"#DIV/0!"}},{"$f":"SUM(S8:S35)/дети!G2","v":{"$error":"#DIV/0!"}},{"$f":"SUM(T8:T35)/дети!G2","v":{"$error":"#DIV/0!"}},{"$f":"SUM(U8:U35)/23","v":0},{"$f":"SUM(V8:V35)/23","v":0}]
[null,"\"3\" Сформирован (В)",{"$f":"COUNTIF(C8:C35,\"=3\")/дети!G2","v":{"$error":"#DIV/0!"}},{"$f":"COUNTIF(D8:D35,\"=3\")/дети!G2","v":{"$error":"#DIV/0!"}},{"$f":"COUNTIF(E8:E35,\"=3\")/дети!G2","v":{"$error":"#DIV/0!"}},{"$f":"COUNTIF(F8:F35,\"=3\")/дети!G2","v":{"$error":"#DIV/0!"}},{"$f":"COUNTIF(G8:G35,\"=3\")/дети!G2","v":{"$error":"#DIV/0!"}},{"$f":"COUNTIF(H8:H35,\"=3\")/дети!G2","v":{"$error":"#DIV/0!"}},{"$f":"COUNTIF(I8:I35,\"=3\")/дети!G2","v":{"$error":"#DIV/0!"}},{"$f":"COUNTIF(J8:J35,\"=3\")/дети!G2","v":{"$error":"#DIV/0!"}},{"$f":"COUNTIF(K8:K35,\"=3\")/дети!G2","v":{"$error":"#DIV/0!"}},{"$f":"COUNTIF(L8:L35,\"=3\")/дети!G2","v":{"$error":"#DIV/0!"}},{"$f":"COUNTIF(M8:M35,\"=3\")/дети!G2","v":{"$error":"#DIV/0!"}},{"$f":"COUNTIF(N8:N35,\"=3\")/дети!G2","v":{"$error":"#DIV/0!"}},{"$f":"COUNTIF(O8:O35,\"=3\")/дети!G2","v":{"$error":"#DIV/0!"}},{"$f":"COUNTIF(P8:P35,\"=3\")/дети!G2","v":{"$error":"#DIV/0!"}},{"$f":"COUNTIF(Q8:Q35,\"=3\")/дети!G2","v":{"$error":"#DIV/0!"}},{"$f":"COUNTIF(R8:R35,\"=3\")/дети!G2","v":{"$error":"#DIV/0!"}},{"$f":"COUNTIF(S8:S35,\"=3\")/дети!G2","v":{"$error":"#DIV/0!"}},{"$f":"COUNTIF(T8:T35,\"=3\")/дети!G2","v":{"$error":"#DIV/0!"}}]
[null,"\"2\" Находится в стадии формирования (С)",{"$f":"COUNTIF(C8:C35,\"=2\")/дети!G2","v":{"$error":"#DIV/0!"}},{"$f":"COUNTIF(D8:D35,\"=2\")/дети!G2","v":{"$error":"#DIV/0!"}},{"$f":"COUNTIF(E8:E35,\"=2\")/дети!G2","v":{"$error":"#DIV/0!"}},{"$f":"COUNTIF(F8:F35,\"=2\")/дети!G2","v":{"$error":"#DIV/0!"}},{"$f":"COUNTIF(G8:G35,\"=2\")/дети!G2","v":{"$error":"#DIV/0!"}},{"$f":"COUNTIF(H8:H35,\"=2\")/дети!G2","v":{"$error":"#DIV/0!"}},{"$f":"COUNTIF(I8:I35,\"=2\")/дети!G2","v":{"$error":"#DIV/0!"}},{"$f":"COUNTIF(J8:J35,\"=2\")/дети!G2","v":{"$error":"#DIV/0!"}},{"$f":"COUNTIF(K8:K35,\"=2\")/дети!G2","v":{"$error":"#DIV/0!"}},{"$f":"COUNTIF(L8:L35,\"=2\")/дети!G2","v":{"$error":"#DIV/0!"}},{"$f":"COUNTIF(M8:M35,\"=2\")/дети!G2","v":{"$error":"#DIV/0!"}},{"$f":"COUNTIF(N8:N35,\"=2\")/дети!G2","v":{"$error":"#DIV/0!"}},{"$f":"COUNTIF(O8:O35,\"=2\")/дети!G2","v":{"$error":"#DIV/0!"}},{"$f":"COUNTIF(P8:P35,\"=2\")/дети!G2","v":{"$error":"#DIV/0!"}},{"$f":"COUNTIF(Q8:Q35,\"=2\")/дети!G2","v":{"$error":"#DIV/0!"}},{"$f":"COUNTIF(R8:R35,\"=2\")/дети!G2","v":{"$error":"#DIV/0!"}},{"$f":"100%-(S39+S37)","v":{"$error":"#DIV/0!"}},{"$f":"100%-(T39+T37)","v":{"$error":"#DIV/0!"}}]
[null,"\"1\" Не сформирован (НС)",{"$f":"COUNTIF(C8:C35,\"=1\")/дети!G2","v":{"$error":"#DIV/0!"}},{"$f":"COUNTIF(D8:D35,\"=1\")/дети!G2","v":{"$error":"#DIV/0!"}},{"$f":"COUNTIF(E8:E35,\"=1\")/дети!G2","v":{"$error":"#DIV/0!"}},{"$f":"COUNTIF(F8:F35,\"=1\")/дети!G2","v":{"$error":"#DIV/0!"}},{"$f":"COUNTIF(G8:G35,\"=1\")/дети!G2","v":{"$error":"#DIV/0!"}},{"$f":"COUNTIF(H8:H35,\"=1\")/дети!G2","v":{"$error":"#DIV/0!"}},{"$f":"COUNTIF(I8:I35,\"=1\")/дети!G2","v":{"$error":"#DIV/0!"}},{"$f":"COUNTIF(J8:J35,\"=1\")/дети!G2","v":{"$error":"#DIV/0!"}},{"$f":"COUNTIF(K8:K35,\"=1\")/дети!G2","v":{"$error":"#DIV/0!"}},{"$f":"COUNTIF(L8:L35,\"=1\")/дети!G2","v":{"$error":"#DIV/0!"}},{"$f":"COUNTIF(M8:M35,\"=1\")/дети!G2","v":{"$error":"#DIV/0!"}},{"$f":"COUNTIF(N8:N35,\"=1\")/дети!G2","v":{"$error":"#DIV/0!"}},{"$f":"COUNTIF(O8:O35,\"=1\")/дети!G2","v":{"$error":"#DIV/0!"}},{"$f":"COUNTIF(P8:P35,\"=1\")/дети!G2","v":{"$error":"#DIV/0!"}},{"$f":"COUNTIF(Q8:Q35,\"=1\")/дети!G2","v":{"$error":"#DIV/0!"}},{"$f":"COUNTIF(R8:R35,\"=1\")/дети!G2","v":{"$error":"#DIV/0!"}},{"$f":"COUNTIF(S8:S35,\"<2\")/дети!G2","v":{"$error":"#DIV/0!"}},{"$f":"COUNTIF(T8:T35,\"<2\")/дети!G2","v":{"$error":"#DIV/0!"}}]

{"sheet":"музыка","index":6,"n_rows":40,"n_cols":13,"rows_kept":40,"merged":[[3,1,3,9],[4,0,7,0],[4,1,7,1],[4,2,6,3],[4,4,6,5],[4,6,6,7],[4,8,6,9],[4,10,6,11],[36,0,36,1]]}
[null,{"$f":"дети!A38","v":"Мониторинг образовательного процесса группы № __  (младшая) на 20__-20__ уч.г."}]
[{"$f":"дети!A39","v":"Воспитатель: _____________________________"}]
[{"$f":"дети!A40","v":"Воспитатель: ________________________________"}]
[null,"«Музыкальная деятельность»  "]
["№ п/п","Фамилия, имя ребенка","Слушает музыкальное произведение до конца. Узнает знакомые песни. Поет, не отставая и не опережая других.",null,"Различает и называет детские музыкальные инструменты (металлофон, барабан и др.).",null,"Умеет выполнять танцевальные движения: кружиться в парах, притопывать попеременно ногами, двигаться под музыку с предметами (флажки, листочки, платочки и т.п).",null,"Итоговый показатель по каждому ребенку",null,"Уровень"]
[]
[]
[null,null,"н.г.","к.г.","н.г.","к.г.","н.г.","к.г.","н.г.","к.г.","н.г.","к.г."]
[1,{"$f":"дети!A1","v":0},{"v":0,"d":"0.0"},{"v":0,"d":"0.0"},{"v":0,"d":"0.0"},{"v":0,"d":"0.0"},{"v":0,"d":"0.0"},{"v":0,"d":"0.0"},{"$f":"(C9+E9+G9)/3","v":{"v":0,"d":"0.0"}},{"$f":"(D9+F9+H9)/3","v":{"v":0,"d":"0.0"}},{"$f":"IF(I9=3,\"B\",IF(I9>=2,\"C\",\"HC\"))","v":"HC"},{"$f":"IF(J9=3,\"B\",IF(J9>=2,\"C\",\"HC\"))","v":"HC"}]
[2,{"$f":"дети!A2","v":0},{"v":0,"d":"0.0"},{"v":0,"d":"0.0"},{"v":0,"d":"0.0"},{"v":0,"d":"0.0"},{"v":0,"d":"0.0"},{"v":0,"d":"0.0"},{"$f":"(C10+E10+G10)/3","v":{"v":0,"d":"0.0"}},{"$f":"(D10+F10+H10)/3","v":{"v":0,"d":"0.0"}},{"$f":"IF(I10=3,\"B\",IF(I10>=2,\"C\",\"HC\"))","v":"HC"},{"$f":"IF(J10=3,\"B\",IF(J10>=2,\"C\",\"HC\"))","v":"HC"}]
[3,{"$f":"дети!A3","v":0},{"v":0,"d":"0.0"},{"v":0,"d":"0.0"},{"v":0,"d":"0.0"},{"v":0,"d":"0.0"},{"v":0,"d":"0.0"},{"v":0,"d":"0.0"},{"v":0,"d":"0.0"},{"v":0,"d":"0.0"},"HC","HC"]
[4,{"$f":"дети!A4","v":0},{"v":0,"d":"0.0"},{"v":0,"d":"0.0"},{"v":0,"d":"0.0"},{"v":0,"d":"0.0"},{"v":0,"d":"0.0"},{"v":0,"d":"0.0"},{"v":0,"d":"0.0"},{"v":0,"d":"0.0"},"HC","HC"]
[5,{"$f":"дети!A5","v":0},{"v":0,"d":"0.0"},{"v":0,"d":"0.0"},{"v":0,"d":"0.0"},{"v":0,"d":"0.0"},{"v":0,"d":"0.0"},{"v":0,"d":"0.0"},{"v":0,"d":"0.0"},{"v":0,"d":"0.0"},"HC","HC"]
[6,{"$f":"дети!A6","v":0},{"v":0,"d":"0.0"},{"v":0,"d":"0.0"},{"v":0,"d":"0.0"},{"v":0,"d":"0.0"},{"v":0,"d":"0.0"},{"v":0,"d":"0.0"},{"v":0,"d":"0.0"},{"v":0,"d":"0.0"},"HC","HC"]
[7,{"$f":"дети!A7","v":0},{"v":0,"d":"0.0"},{"v":0,"d":"0.0"},{"v":0,"d":"0.0"},{"v":0,"d":"0.0"},{"v":0,"d":"0.0"},{"v":0,"d":"0.0"},{"v":0,"d":"0.0"},{"v":0,"d":"0.0"},"HC","HC"]
[8,{"$f":"дети!A8","v":0},{"v":0,"d":"0.0"},{"v":0,"d":"0.0"},{"v":0,"d":"0.0"},{"v":0,"d":"0.0"},{"v":0,"d":"0.0"},{"v":0,"d":"0.0"},{"v":0,"d":"0.0"},{"v":0,"d":"0.0"},"HC","HC"]
[9,{"$f":"дети!A9","v":0},{"v":0,"d":"0.0"},{"v":0,"d":"0.0"},{"v":0,"d":"0.0"},{"v":0,"d":"0.0"},{"v":0,"d":"0.0"},{"v":0,"d":"0.0"},{"v":0,"d":"0.0"},{"v":0,"d":"0.0"},"HC","HC"]
[10,{"$f":"дети!A10","v":0},{"v":0,"d":"0.0"},{"v":0,"d":"0.0"},{"v":0,"d":"0.0"},{"v":0,"d":"0.0"},{"v":0,"d":"0.0"},{"v":0,"d":"0.0"},{"v":0,"d":"0.0"},{"v":0,"d":"0.0"},"HC","HC"]
[11,{"$f":"дети!A11","v":0},{"v":0,"d":"0.0"},{"v":0,"d":"0.0"},{"v":0,"d":"0.0"},{"v":0,"d":"0.0"},{"v":0,"d":"0.0"},{"v":0,"d":"0.0"},{"v":0,"d":"0.0"},{"v":0,"d":"0.0"},"HC","HC"]
[12,{"$f":"дети!A12","v":0},{"v":0,"d":"0.0"},{"v":0,"d":"0.0"},{"v":0,"d":"0.0"},{"v":0,"d":"0.0"},{"v":0,"d":"0.0"},{"v":0,"d":"0.0"},{"v":0,"d":"0.0"},{"v":0,"d":"0.0"},"HC","HC"]
[13,{"$f":"дети!A13","v":0},{"v":0,"d":"0.0"},{"v":0,"d":"0.0"},{"v":0,"d":"0.0"},{"v":0,"d":"0.0"},{"v":0,"d":"0.0"},{"v":0,"d":"0.0"},{"v":0,"d":"0.0"},{"v":0,"d":"0.0"},"HC","HC"]
[14,{"$f":"дети!A14","v":0},{"v":0,"d":"0.0"},{"v":0,"d":"0.0"},{"v":0,"d":"0.0"},{"v":0,"d":"0.0"},{"v":0,"d":"0.0"},{"v":0,"d":"0.0"},{"v":0,"d":"0.0"},{"v":0,"d":"0.0"},"HC","HC"]
[15,{"$f":"дети!A15","v":0},{"v":0,"d":"0.0"},{"v":0,"d":"0.0"},{"v":0,"d":"0.0"},{"v":0,"d":"0.0"},{"v":0,"d":"0.0"},{"v":0,"d":"0.0"},{"v":0,"d":"0.0"},{"v":0,"d":"0.0"},"HC","HC"]
[16,{"$f":"дети!A16","v":0},{"v":0,"d":"0.0"},{"v":0,"d":"0.0"},{"v":0,"d":"0.0"},{"v":0,"d":"0.0"},{"v":0,"d":"0.0"},{"v":0,"d":"0.0"},{"v":0,"d":"0.0"},{"v":0,"d":"0.0"},"HC","HC"]
[17,{"$f":"дети!A17","v":0},{"v":0,"d":"0.0"},{"v":0,"d":"0.0"},{"v":0,"d":"0.0"},{"v":0,"d":"0.0"},{"v":0,"d":"0.0"},{"v":0,"d":"0.0"},{"v":0,"d":"0.0"},{"v":0,"d":"0.0"},"HC","HC"]
[18,{"$f":"дети!A18","v":0},{"v":0,"d":"0.0"},{"v":0,"d":"0.0"},{"v":0,"d":"0.0"},{"v":0,"d":"0.0"},{"v":0,"d":"0.0"},{"v":0,"d":"0.0"},{"v":0,"d":"0.0"},{"v":0,"d":"0.0"},"HC","HC"]
[19,{"$f":"дети!A19","v":0},{"v":0,"d":"0.0"},{"v":0,"d":"0.0"},{"v":0,"d":"0.0"},{"v":0,"d":"0.0"},{"v":0,"d":"0.0"},{"v":0,"d":"0.0"},{"v":0,"d":"0.0"},{"v":0,"d":"0.0"},"HC","HC"]
[20,{"$f":"дети!A20","v":0},{"v":0,"d":"0.0"},{"v":0,"d":"0.0"},{"v":0,"d":"0.0"},{"v":0,"d":"0.0"},{"v":0,"d":"0.0"},{"v":0,"d":"0.0"},{"v":0,"d":"0.0"},{"v":0,"d":"0.0"},"HC","HC"," "]
[21,{"$f":"дети!A21","v":0},{"v":0,"d":"0.0"},{"v":0,"d":"0.0"},{"v":0,"d":"0.0"},{"v":0,"d":"0.0"},{"v":0,"d":"0.0"},{"v":0,"d":"0.0"},{"v":0,"d":"0.0"},{"v":0,"d":"0.0"},"HC","HC"]
[22,{"$f":"дети!A22","v":0},{"v":0,"d":"0.0"},{"v":0,"d":"0.0"},{"v":0,"d":"0.0"},{"v":0,"d":"0.0"},{"v":0,"d":"0.0"},{"v":0,"d":"0.0"},{"v":0,"d":"0.0"},{"v":0,"d":"0.0"},"HC","HC"]
[23,{"$f":"дети!A23","v":0},{"v":0,"d":"0.0"},{"v":0,"d":"0.0"},{"v":0,"d":"0.0"},{"v":0,"d":"0.0"},{"v":0,"d":"0.0"},{"v":0,"d":"0.0"},{"v":0,"d":"0.0"},{"v":0,"d":"0.0"},"HC","HC"]
[24,{"$f":"дети!A24","v":0},{"v":0,"d":"0.0"},{"v":0,"d":"0.0"},{"v":0,"d":"0.0"},{"v":0,"d":"0.0"},{"v":0,"d":"0.0"},{"v":0,"d":"0.0"},{"v":0,"d":"0.0"},{"v":0,"d":"0.0"},"HC","HC"]
[25,{"$f":"дети!A25","v":0},{"v":0,"d":"0.0"},{"v":0,"d":"0.0"},{"v":0,"d":"0.0"},{"v":0,"d":"0.0"},{"v":0,"d":"0.0"},{"v":0,"d":"0.0"},{"v":0,"d":"0.0"},{"v":0,"d":"0.0"},"HC","HC"]
[26,{"$f":"дети!A26","v":0},{"v":0,"d":"0.0"},{"v":0,"d":"0.0"},{"v":0,"d":"0.0"},{"v":0,"d":"0.0"},{"v":0,"d":"0.0"},{"v":0,"d":"0.0"},{"v":0,"d":"0.0"},{"v":0,"d":"0.0"},"HC","HC"," "]
[27,{"$f":"дети!A27","v":0},{"v":0,"d":"0.0"},{"v":0,"d":"0.0"},{"v":0,"d":"0.0"},{"v":0,"d":"0.0"},{"v":0,"d":"0.0"},{"v":0,"d":"0.0"},{"v":0,"d":"0.0"},{"v":0,"d":"0.0"},"HC","HC"]
[28,{"$f":"дети!A28","v":0},{"v":0,"d":"0.0"},{"v":0,"d":"0.0"},{"v":0,"d":"0.0"},{"v":0,"d":"0.0"},{"v":0,"d":"0.0"},{"v":0,"d":"0.0"},{"v":0,"d":"0.0"},{"v":0,"d":"0.0"},"HC","HC"]
["Итоговый пок-ль по группе (ср. знач.)",null,{"$f":"SUM(C9:C36)/дети!G2","v":{"$error":"#DIV/0!"}},{"$f":"SUM(D9:D36)/дети!G2","v":{"$error":"#DIV/0!"}},{"$f":"SUM(E9:E36)/дети!G2","v":{"$error":"#DIV/0!"}},{"$f":"SUM(F9:F36)/дети!G2","v":{"$error":"#DIV/0!"}},{"$f":"SUM(G9:G36)/дети!G2","v":{"$error":"#DIV/0!"}},{"$f":"SUM(H9:H36)/дети!G2","v":{"$error":"#DIV/0!"}},{"$f":"SUM(I9:I36)/дети!G2","v":{"$error":"#DIV/0!"}},{"$f":"SUM(J9:J36)/дети!G2","v":{"$error":"#DIV/0!"}}]
[null,"\"3\" Сформирован (В)",{"$f":"COUNTIF(C9:C36,\"=3\")/дети!G2","v":{"$error":"#DIV/0!"}},{"$f":"COUNTIF(D9:D36,\"=3\")/дети!G2","v":{"$error":"#DIV/0!"}},{"$f":"COUNTIF(E9:E36,\"=3\")/дети!G2","v":{"$error":"#DIV/0!"}},{"$f":"COUNTIF(F9:F36,\"=3\")/дети!G2","v":{"$error":"#DIV/0!"}},{"$f":"COUNTIF(G9:G36,\"=3\")/дети!G2","v":{"$error":"#DIV/0!"}},{"$f":"COUNTIF(H9:H36,\"=3\")/дети!G2","v":{"$error":"#DIV/0!"}},{"$f":"COUNTIF(I9:I36,\"=3\")/дети!G2","v":{"$error":"#DIV/0!"}},{"$f":"COUNTIF(J9:J36,\"=3\")/дети!G2","v":{"$error":"#DIV/0!"}}]
[null,"\"2\" Находится в стадии формирования (С)",{"$f":"COUNTIF(C9:C36,\"=2\")/дети!G2","v":{"$error":"#DIV/0!"}},{"$f":"COUNTIF(D9:D36,\"=2\")/дети!G2","v":{"$error":"#DIV/0!"}},{"$f":"COUNTIF(E9:E36,\"=2\")/дети!G2","v":{"$error":"#DIV/0!"}},{"$f":"COUNTIF(F9:F36,\"=2\")/дети!G2","v":{"$error":"#DIV/0!"}},{"$f":"COUNTIF(G9:G36,\"=2\")/дети!G2","v":{"$error":"#DIV/0!"}},{"$f":"COUNTIF(H9:H36,\"=2\")/дети!G2","v":{"$error":"#DIV/0!"}},{"$f":"100%-(I40+I38)","v":{"$error":"#DIV/0!"}},{"$f":"100%-(J40+J38)","v":{"$error":"#DIV/0!"}}]
[null,"\"1\" Не сформирован (НС)",{"$f":"COUNTIF(C9:C36,\"=1\")/дети!G2","v":{"$error":"#DIV/0!"}},{"$f":"COUNTIF(D9:D36,\"=1\")/дети!G2","v":{"$error":"#DIV/0!"}},{"$f":"COUNTIF(E9:E36,\"=1\")/дети!G2","v":{"$error":"#DIV/0!"}},{"$f":"COUNTIF(F9:F36,\"=1\")/дети!G2","v":{"$error":"#DIV/0!"}},{"$f":"COUNTIF(G9:G36,\"=1\")/дети!G2","v":{"$error":"#DIV/0!"}},{"$f":"COUNTIF(H9:H36,\"=1\")/дети!G2","v":{"$error":"#DIV/0!"}},{"$f":"COUNTIF(I9:I36,\"<2\")/дети!G2","v":{"$error":"#DIV/0!"}},{"$f":"COUNTIF(J9:J36,\"<2\")/дети!G2","v":{"$error":"#DIV/0!"}}]

{"sheet":"дети","index":7,"n_rows":40,"n_cols":7,"rows_kept":40}
[]
[{"$nulls":4},"количество детей",null,0]
{"$rows_empty":27}
[" "]
[" "]
[" "]
[" "]
[" "]
[" "]
[" "]
[]
["Мониторинг образовательного процесса группы № __  (младшая) на 20__-20__ уч.г."]
["Воспитатель: _____________________________"]
["Воспитатель: ________________________________"]

{"sheet":"АННОТАЦИЯ","index":8,"n_rows":11,"n_cols":1,"rows_kept":11}
[]
["вкладка \"Дети\""]
["1.В столбец \"А\" - вписать детей (\"автоматом выпрыгнут\")"]
["2.количество детей ячейка - \"G2\" надо обязательно свои данные поставить"]
["3. Вписать 34,35,36 строки - \"автоматом\" выходят на остальных страницах"]
[]
[]
["4. Чтобы формулы были верны, надо в каждой таблице ненужные строки с детьми (начиная с нижних) удалить"]
["5. Данные в ячейках не удаляйте, чтобы не сбить формулы. Можно удалять/очищать данные на начало/конец года, напротив детей И ВСЕ!!!"]
["В цветных ячейках формулы - НЕ МЕНЯТЬ, НЕ УДАЛЯТЬ"]
["6. Вкладка \"МОНИТОРИНГ\" программируется сама. Данные вбивать не надо"]

{"sheet":"Лист1","index":9,"n_rows":0,"n_cols":0,"rows_kept":0}